program: Gaussian 09
title: 000251341
version: EM64L-G09RevD.01
frameworkgroup: C1[X(C15H24O)]
method: RPBEPBE
basis: SDD
operation: Freq
keyword: #pfreq=noraman
keyword: PBEPBE/SDD
title: #p freq=noraman PBEPBE/SDD
converged: YES YES NO NO
title: Mulliken charges:
elementType: O C C C C C C C C C C C C C C C H H H H H H H H H H H H H H H H H H H H H H H H
charge: -0.485687 0.168064 -0.431331 -0.431226 -0.025331 -0.025331 0.333918 -0.729631 -0.719538 -0.729649 -0.719569 -0.389001 -0.396776 -0.254911 -0.221214 -0.245967 0.183435 0.195748 0.183499 0.195730 0.230890 0.230923 0.205692 0.189104 0.259260 0.215694 0.210535 0.203985 0.189125 0.205714 0.259161 0.215671 0.210584 0.203996 0.336920 0.221580 0.284215 0.222753 0.223364 0.225601
chargesum: 0.00000
title: Mulliken charges with hydrogens summed into heavy atoms:
elementType: O C C C C C C C C C C C C C C C
charge: -0.148766 0.168064 -0.052148 -0.051997 0.205559 0.205592 0.333918 -0.075575 -0.089325 -0.075648 -0.089318 -0.167421 -0.112560 -0.032158 0.002150 -0.020366
polarizability: 1.46189943e+02 -1.16562019e-02 1.79321240e+02 3.06579216e-02 1.40192145e-01 1.54158436e+02
1716.lowfreq: -9.3861 0.0000 0.0003 0.0007 2.4717 12.0624 30.7427 38.6689 40.3873
frequency: 30.7174 38.3212 40.1294 60.0731 69.4724 98.2501 162.9111 200.7028 207.7287 210.7116 217.9456 230.0923 233.9309 253.1341 281.7925 310.0209 310.5972 325.6687 329.4569 374.7613 402.6009 415.9599 416.8527 424.6380 464.6826 492.9427 551.2235 616.8895 649.4211 706.8938 708.5828 774.8481 792.5094 823.0599 850.0124 855.0715 869.8711 916.4633 916.8194 922.7082 929.4055 939.6527 954.9867 957.1682 979.2680 979.7625 989.8131 999.5206 1024.8124 1041.0774 1047.9523 1081.2898 1097.9632 1130.1028 1137.8104 1144.5266 1159.6391 1171.8113 1178.2141 1183.4099 1191.9232 1223.4631 1223.8552 1284.9923 1296.7727 1317.3474 1329.5647 1331.0345 1336.5258 1348.5047 1370.0473 1371.5329 1374.0861 1379.8420 1391.0924 1393.2365 1433.5303 1444.6436 1457.6950 1467.3197 1468.7675 1470.5926 1472.9083 1479.3460 1479.9370 1483.9276 1493.5826 1494.5234 1589.7496 1613.0680 2940.5062 2947.5765 2962.2362 2962.3256 2964.8402 2965.4580 2985.8077 2987.2592 3007.0830 3017.3995 3049.8871 3050.0741 3059.1956 3059.7136 3067.4323 3067.6845 3097.0867 3097.2026 3115.6656 3125.6225 3138.8221 3157.1251 3179.0231 3569.5601
redmass: 2.6729 3.3917 2.6938 3.8118 3.1731 3.4360 1.8285 1.4174 1.2044 1.9052 1.8898 1.4595 1.8855 1.8684 1.8297 2.1854 2.9163 1.6998 3.3411 2.1261 2.8077 2.1888 1.8471 2.7793 2.4812 3.2032 3.2218 6.4060 3.4894 1.6640 4.7396 2.0327 2.8204 2.9663 2.5771 1.2750 1.4666 1.2383 1.1854 1.4722 1.7030 1.9145 1.4206 1.4708 1.3639 2.1226 6.2381 1.3177 2.6623 2.7560 2.5015 1.6042 1.4650 1.6692 2.5991 2.0820 2.1732 1.0681 1.8016 1.8271 1.1484 1.3016 1.5364 1.3048 1.2631 1.3620 1.4850 1.5625 1.4577 1.4231 1.4495 1.2061 1.3634 6.0752 1.2116 1.2282 2.2272 1.0819 1.0820 1.0502 1.0515 1.0519 1.0647 1.0488 1.1022 2.0912 1.0517 1.0531 6.2019 6.0754 1.0632 1.0627 1.0371 1.0370 1.0386 1.0390 1.0812 1.0810 1.0964 1.0961 1.0979 1.0979 1.0986 1.0984 1.0991 1.0990 1.0979 1.0979 1.0852 1.0876 1.0938 1.0991 1.0952 1.0656
irintensity: 0.6383 0.0092 0.0332 0.0555 0.0082 0.1704 7.0693 0.5842 0.0694 1.3981 33.8723 1.4577 0.7087 0.2150 17.7176 14.9034 1.7040 146.9515 2.9664 0.0074 0.5907 0.1115 0.1443 1.5198 1.2477 0.7131 11.0594 0.0621 27.5080 70.2088 0.9146 29.3372 2.7071 7.7681 6.5120 0.1547 9.4038 14.0343 4.9660 7.6414 26.9623 3.4253 0.1674 0.0072 0.2877 18.5726 0.0822 1.0633 7.9811 5.2291 0.2270 11.4795 1.7235 28.3617 3.1200 40.5042 0.8991 0.2481 34.5007 3.6060 0.2349 3.0425 4.8333 7.4751 1.3937 2.5692 2.4815 1.3029 6.0014 3.0465 12.5870 0.6131 54.7884 2.0808 20.9202 13.6198 14.4068 0.0227 3.2787 0.0175 6.5801 0.8999 19.1071 0.1747 24.5752 7.3402 16.1996 15.0915 0.9824 5.6403 7.2826 51.4237 0.5643 61.8231 65.3509 40.5982 3.1283 27.3347 3.9889 53.0733 18.1022 13.7557 6.6311 153.8887 70.5860 38.1176 21.2638 14.6853 7.0433 3.5525 37.7062 29.1223 5.6329 3.9466
temp: 298.150 k
press: 1.00000 atm
elementType: 8 6 6 6 6 6 6 6 6 6 6 6 6 6 6 6 1 1 1 1 1 1 1 1 1 1 1 1 1 1 1 1 1 1 1 1 1 1 1 1
symmnumber: 1
zpe: 922767.3 jmol-1
zpe.correction: 0.351464 hartree
zpe.thermalcorrener: 0.369714 hartree
zpe.thermalcorrenthalpy: 0.370658 hartree
zpe.thermalcorrgfe: 0.305071 hartree
zpe.sumelectzpe: -659.958030 hartree
zpe.sumelectthermal: -659.939779 hartree
zpe.sumelectthermalent: -659.938835 hartree
zpe.sumelectthermalfe: -660.004423 hartree
dipole: 0.0000 -0.9400 -1.1503
dipole: 1.4855
quadrupole: -104.6500 -91.7519 -98.3941
quadrupole: -0.0032 0.0087 -0.6023
quadrupole: -6.3847 6.5134 -0.1287 -0.0032 0.0087 -0.6023
hfenergy: -660.3094931 hartree
pointgroup: C01 [X(C15H24O1)]
dipole: -0.0002952 0.3884651 0.4366656 debye
polarizability: 146.1900883|0.0394698|179.2888199|-0.0430524|-0.9128061|154.1907109 unknown
InChI: InChI=1S/C15H24O/c1-12(2)10-15(16,11-13(3)4)14-8-6-5-7-9-14/h5-9,12-13,16H,10-11H2,1-4H3
charge 0 multiplicity 1
40 atoms
O  0.004106 1.253305 -1.565494
C  0.00125 0.893071 -0.123574
C  -1.268492 1.488729 0.571415
C  1.270232 1.485466 0.575575
C  -2.65987 0.977579 0.10629
C  2.661818 0.972017 0.113521
C  -0.000674 -0.640916 -0.065495
C  -3.081401 1.527805 -1.278072
C  -3.723814 1.341336 1.171691
C  3.088981 1.524677 -1.268153
C  3.723411 1.33062 1.183012
C  -0.004359 -1.300869 1.19147
C  0.001251 -1.426443 -1.243854
C  -0.006095 -2.710484 1.269045
C  -0.000512 -2.83854 -1.167958
C  -0.004175 -3.487923 0.08705
H  -1.172703 1.285822 1.65745
H  -1.231194 2.59582 0.465472
H  1.17104 1.281424 1.661084
H  1.235436 2.592757 0.470852
H  -2.610209 -0.127646 0.037371
H  2.6097 -0.132912 0.041737
H  -4.087694 1.157808 -1.551225
H  -3.127631 2.635622 -1.2596
H  -2.369077 1.222941 -2.061622
H  -4.725736 0.986018 0.866798
H  -3.486553 0.888095 2.152911
H  -3.785256 2.438844 1.310155
H  3.137298 2.632351 -1.246853
H  4.095475 1.153387 -1.538796
H  2.378817 1.222994 -2.054896
H  4.725438 0.973842 0.88016
H  3.482225 0.875353 2.162328
H  3.786908 2.427626 1.324506
H  0.005102 2.24153 -1.626646
H  -0.005951 -0.716083 2.119471
H  0.004105 -0.918869 -2.211402
H  -0.008978 -3.201449 2.249042
H  0.001004 -3.430437 -2.090671
H  -0.005526 -4.58227 0.145505
