program: Gaussian 09
title: 000251335
version: EM64L-G09RevD.01
frameworkgroup: C1[X(C15H16O2)]
method: RPBEPBE
basis: SDD
operation: Freq
keyword: #pfreq=noraman
keyword: PBEPBE/SDD
title: #p freq=noraman PBEPBE/SDD
converged: NO YES NO NO
title: Mulliken charges:
elementType: O O C C C C C C C C C C C C C C C H H H H H H H H H H H H H H H H
charge: -0.295374 -0.282087 -0.347199 -0.272140 0.392004 -0.306361 -0.387737 -0.402303 0.365089 -0.225321 -0.216265 -0.241311 -0.346485 -0.375994 -0.223310 -0.196383 -0.256232 0.207318 0.206310 0.203995 0.207953 0.223576 0.220438 0.226156 0.268907 0.225133 0.224498 0.227229 0.249399 0.248145 0.223651 0.226932 0.227770
chargesum: 0.00000
title: Mulliken charges with hydrogens summed into heavy atoms:
elementType: O O C C C C C C C C C C C C C C C
charge: -0.295374 -0.282087 0.066429 0.139808 0.392004 0.137653 -0.161580 -0.133396 0.365089 -0.000188 0.008233 -0.014082 -0.097086 -0.127849 0.000341 0.030548 -0.028462
polarizability: 2.42796564e+02 6.04295146e-01 1.68735130e+02 -5.43961752e+00 1.50056595e+00 8.01454785e+01
1716.lowfreq: -2.1797 -0.0011 -0.0006 -0.0005 4.3375 8.7575 12.3515 21.8239 35.4225
frequency: 11.6532 21.6589 35.3875 46.8207 79.6212 110.6896 113.5570 139.8422 180.1051 204.8042 230.8578 249.3947 367.8278 394.1139 402.0574 412.5292 462.5732 502.7199 509.1224 564.6371 605.1533 610.9216 616.4727 692.0470 702.2504 738.6137 758.3833 789.4212 808.6382 820.7014 846.7438 855.6285 890.8467 909.3406 941.4226 961.1049 979.0498 980.4514 981.9298 989.5384 994.0702 994.8237 1015.7536 1023.2668 1026.5637 1065.3192 1083.4451 1084.7855 1110.2403 1111.4385 1167.3481 1171.4275 1174.0582 1179.7047 1184.3582 1202.9394 1217.3977 1223.8303 1265.5836 1301.2052 1314.3402 1325.2131 1357.5270 1384.0490 1390.6047 1412.8933 1439.8122 1444.1259 1467.2744 1475.5179 1485.4648 1487.3600 1494.9818 1592.4867 1595.3813 1612.4446 1618.3305 2904.9519 2945.7207 2950.5256 2976.1395 2998.0240 3047.3758 3110.1394 3125.7534 3127.8361 3136.5891 3139.7513 3154.7620 3158.3652 3163.2534 3172.2852 3175.0314
redmass: 3.6599 4.2797 4.9973 3.9836 4.2832 2.5472 4.5226 2.3838 6.4815 3.1650 5.0343 4.3088 4.4748 5.2115 2.8762 2.9308 2.8409 2.8563 4.4873 6.8336 5.6048 6.4015 6.3408 2.0456 2.2900 1.3743 1.6514 6.5200 4.0841 1.2326 1.1206 1.2512 1.4467 1.3194 7.4662 1.3591 1.3814 6.0305 1.2996 6.1487 1.7235 3.2714 1.7194 2.0442 2.2141 4.6204 1.5321 1.8635 1.7506 2.1926 1.0754 1.0534 1.1116 1.1578 1.1115 1.1357 2.2655 3.6764 1.1430 1.3552 1.3328 1.2565 1.5789 5.4848 4.7759 1.6548 2.1105 2.3660 1.1027 1.7658 2.1094 1.2824 1.1175 6.4569 6.1908 6.2593 6.0524 1.0566 1.0568 1.1006 1.0550 1.1063 1.1098 1.0877 1.0866 1.0847 1.0890 1.0930 1.0925 1.0984 1.0953 1.1006 1.0962
irintensity: 0.0900 0.0066 0.2679 1.8375 3.3817 6.1066 0.6800 10.1340 0.7674 2.1022 0.6467 3.5199 1.6974 0.7173 0.2000 0.0396 9.7005 12.3422 6.4436 4.6016 1.3363 1.0084 0.1164 34.0911 28.2770 86.5084 92.6430 18.9215 1.7938 0.1808 0.4562 0.1268 8.2377 2.1370 14.6062 0.0560 0.0745 7.1568 0.6304 0.1111 6.3129 28.9635 2.7081 20.0678 26.5565 197.5816 15.8855 35.6840 9.1463 25.8723 6.9156 0.3511 2.9759 33.9691 3.3005 4.8655 1.0860 257.4178 0.0644 21.2963 1.4794 5.5861 9.1968 9.7721 0.5500 4.5944 14.9388 3.3765 20.7048 120.6371 9.9650 17.7056 1.5914 24.9974 1.8760 87.6817 5.7683 44.5716 52.1985 48.5547 36.9451 23.1706 58.7187 10.9431 0.9176 2.6597 11.5781 32.7322 34.0388 33.2295 22.9272 5.5004 7.0589
temp: 298.150 k
press: 1.00000 atm
elementType: 8 8 6 6 6 6 6 6 6 6 6 6 6 6 6 6 6 1 1 1 1 1 1 1 1 1 1 1 1 1 1 1 1
symmnumber: 1
zpe: 707594.1 jmol-1
zpe.correction: 0.269508 hartree
zpe.thermalcorrener: 0.285171 hartree
zpe.thermalcorrenthalpy: 0.286115 hartree
zpe.thermalcorrgfe: 0.222457 hartree
zpe.sumelectzpe: -730.375608 hartree
zpe.sumelectthermal: -730.359946 hartree
zpe.sumelectthermalent: -730.359001 hartree
zpe.sumelectthermalfe: -730.422660 hartree
dipole: 0.6192 -0.5044 0.0557
dipole: 0.8006
quadrupole: -91.7524 -89.4667 -106.7637
quadrupole: -4.7093 -0.5562 0.4597
quadrupole: 4.2419 6.5275 -10.7694 -4.7093 -0.5562 0.4597
hfenergy: -730.6451166 hartree
pointgroup: C01 [X(C15H16O2)]
dipole: 0.2537076 0.094856 -0.1607518 debye
polarizability: 241.1829744|11.2237582|107.2895473|12.0560999|-39.8681275|143.2046503 unknown
InChI: InChI=1S/C15H16O2/c1-3-7-14(8-4-1)13-16-11-12-17-15-9-5-2-6-10-15/h1-10H,11-13H2
charge 0 multiplicity 1
33 atoms
O  1.19548 0.404529 -0.309852
O  -2.374393 0.510699 -1.094234
C  2.427627 0.845703 -0.96683
C  0.006925 0.698108 -1.11231
C  3.627023 0.446038 -0.12475
C  -1.183887 0.219675 -0.283274
C  4.894514 1.016709 -0.404481
C  3.511141 -0.50415 0.917417
C  -3.627212 0.157356 -0.564099
C  6.032388 0.637061 0.340937
C  4.649848 -0.880551 1.66684
C  5.913399 -0.315086 1.380747
C  -3.815576 -0.459287 0.697742
C  -4.740573 0.460615 -1.387584
C  -5.128439 -0.770013 1.124867
C  -6.040359 0.144885 -0.94705
C  -6.243968 -0.473178 0.31232
H  2.406987 1.949366 -1.110054
H  2.494209 0.379253 -1.977216
H  -0.078628 1.78716 -1.313613
H  0.04047 0.160862 -2.084095
H  -1.224295 0.763075 0.681032
H  -1.101995 -0.867285 -0.08532
H  4.993962 1.761643 -1.204934
H  2.527876 -0.929763 1.135876
H  7.006622 1.085508 0.1155
H  4.549498 -1.614599 2.47468
H  6.794608 -0.608242 1.962536
H  -2.966303 -0.698065 1.344796
H  -4.562706 0.937455 -2.356636
H  -5.27258 -1.247149 2.100951
H  -6.897837 0.380822 -1.587242
H  -7.256228 -0.717153 0.651135
