program: Gaussian 09
title: 000251357
version: EM64L-G09RevD.01
frameworkgroup: C1[X(C19H14ClNOS)]
method: RPBEPBE
basis: SDD
operation: Freq
keyword: #p
keyword: freq=noraman
keyword: PBEPBE/SDD
title: #p freq=noraman PBEPBE/SDD
converged: YES YES NO NO
title: Mulliken charges:
elementType: Cl S O N C C C C C C C C C C C C C C C C C C C H H H H H H H H H H H H H H
charge: -0.016125 0.252120 -0.195105 -0.361861 0.350165 0.507099 0.282191 -0.388140 -0.332172 0.424869 -0.298801 -0.306888 -0.473474 -0.432021 -0.403696 0.229273 0.463734 -0.403550 -0.434517 -0.250567 -0.240058 -0.717755 -0.807060 0.255112 0.264987 0.247082 0.254165 0.272366 0.237043 0.244456 0.236466 0.234934 0.294230 0.315486 0.229119 0.228502 0.238393
chargesum: 0.00000
title: Mulliken charges with hydrogens summed into heavy atoms:
elementType: Cl S O N C C C C C C C C C C C C C C C C C C C
charge: -0.016125 0.252120 -0.195105 -0.361861 0.350165 0.507099 0.282191 -0.388140 -0.332172 0.424869 -0.043689 -0.041902 -0.226392 -0.177856 -0.131330 0.229273 0.463734 -0.166507 -0.190061 -0.014101 -0.005124 -0.108039 -0.111046
polarizability: 3.28911099e+02 -1.47969273e+01 2.13055901e+02 1.90563856e+01 3.77539062e+01 2.05812639e+02
1716.lowfreq: -10.8743 -0.0009 -0.0007 0.0020 6.0024 7.9736 14.5399 28.1194 39.0618
frequency: -7.2202 27.5709 39.0461 60.3790 64.7959 76.5169 89.4055 114.2518 145.2390 169.5169 181.6527 218.7201 230.5271 244.3176 266.0906 311.4653 333.9423 346.2537 369.7247 383.4577 396.2821 429.8183 445.4533 452.6984 502.7809 506.2936 516.4456 525.9847 542.3756 571.8608 589.1665 620.9482 647.9703 663.9432 674.4124 693.1829 720.9952 733.5355 763.5300 783.6883 795.3845 819.2285 829.2535 837.9965 850.6639 875.6723 888.1419 906.7140 916.4548 931.5220 956.0166 959.7441 979.5272 996.3704 999.0943 1028.9786 1039.0071 1048.8792 1084.2995 1134.9706 1137.9270 1153.1514 1158.1420 1172.1531 1179.9224 1213.9016 1226.1098 1239.3987 1259.4141 1269.2135 1279.1039 1299.6471 1356.8659 1368.5768 1393.2207 1398.7437 1402.4689 1415.1603 1424.6513 1427.8740 1445.8399 1471.2512 1473.3194 1482.1937 1508.2592 1568.8131 1577.7111 1588.9807 1608.8822 1623.1072 1628.3540 2978.0497 3050.9922 3060.0313 3088.9476 3127.1294 3127.8261 3134.4256 3135.4671 3136.4654 3138.4391 3151.1415 3160.3606 3167.7277 3181.7778
redmass: 1.0129 7.9411 5.5827 5.8501 8.2082 6.4318 3.0561 4.3228 4.9834 5.9156 4.4382 5.5256 5.5607 5.5865 7.4368 5.2057 4.7875 6.4363 7.5481 5.7102 7.7690 3.4319 3.6457 4.5012 4.4646 4.1537 4.3874 6.7952 4.2096 3.9032 3.6445 7.2154 6.4327 4.9351 6.3092 6.8818 4.3486 6.6415 1.2666 3.7654 5.0267 1.4450 1.4120 4.5721 6.5254 1.3583 1.5917 5.2395 1.8993 4.9026 1.4104 1.3438 1.4068 1.4253 1.3287 2.3850 2.7769 1.7226 3.4003 2.5021 1.5503 1.3965 1.3269 1.3089 1.1317 1.8141 2.0194 2.1358 2.7092 1.5882 1.7498 2.1462 3.5049 5.6002 3.6071 1.2278 3.8537 3.9834 1.1076 3.4423 2.4115 1.1133 1.0556 3.0074 3.6907 7.1543 7.4222 6.1806 7.0958 9.9028 6.7548 1.0387 1.0564 1.0951 1.0998 1.0878 1.1064 1.0879 1.0914 1.0879 1.0910 1.0948 1.0971 1.1005 1.0953
irintensity: 0.4775 0.3733 1.7378 0.2672 0.4285 0.6072 6.0038 0.5447 0.4617 1.4650 0.8478 1.2489 3.4876 1.1954 2.0708 4.5968 1.2235 0.8117 3.5132 1.5801 0.5248 1.2538 4.7750 2.6533 12.5015 1.0189 6.2265 5.9594 2.0240 1.1203 4.9675 2.8008 20.1007 4.1916 5.4283 28.1784 3.0538 22.0996 28.5519 32.4527 3.4545 19.4311 83.9675 3.7338 18.4983 6.7585 6.7964 3.1959 4.8285 4.2010 0.9055 0.0159 3.9731 3.0203 0.0895 3.5440 9.4205 10.2303 3.4693 57.8926 28.3421 3.9162 52.1217 27.9729 3.4196 3.5874 48.2922 15.5958 59.4370 8.5886 16.9274 92.7645 36.1236 0.7893 9.7364 9.6210 28.0633 3.2600 16.8871 3.2704 19.4842 18.5966 14.0762 91.6280 24.6006 37.5830 5.5551 10.0131 38.2145 155.3578 13.0922 37.6035 4.6518 20.6347 15.5330 1.7568 2.5255 2.8624 7.2585 3.8360 14.9849 20.0772 13.1469 27.0202 1.9465
temp: 298.150 k
press: 1.00000 atm
elementType: 17 16 8 7 6 6 6 6 6 6 6 6 6 6 6 6 6 6 6 6 6 6 6 1 1 1 1 1 1 1 1 1 1 1 1 1 1
symmnumber: 1
zpe: 722085.7 jmol-1
zpe.correction: 0.275028 hartree
zpe.thermalcorrener: 0.293951 hartree
zpe.thermalcorrenthalpy: 0.294895 hartree
zpe.thermalcorrgfe: 0.226735 hartree
zpe.sumelectzpe: -1718.955249 hartree
zpe.sumelectthermal: -1718.936326 hartree
zpe.sumelectthermalent: -1718.935382 hartree
zpe.sumelectthermalfe: -1719.003542 hartree
dipole: 0.8495 -5.5843 1.4227
dipole: 5.8249
quadrupole: -121.3872 -161.9136 -140.2778
quadrupole: -3.2870 0.4281 8.3973
quadrupole: 19.8057 -20.7208 0.9151 -3.2870 0.4281 8.3973
hfenergy: -1719.2302771 hartree
pointgroup: C01 [X(C19H14Cl1N1O1S1)]
dipole: 0.6601121 1.9454089 -1.0156624 debye
polarizability: 330.8961463|-5.7992592|228.4805826|-11.305906|34.8917785|188.4029098 unknown
InChI: InChI=1S/C19H14ClNOS/c1-12-6-8-15-17(10-12)23-16-9-7-13-4-2-3-5-14(13)19(16)21(15)18(22)11-20/h2-10H,11H2,1H3
charge 0 multiplicity 1
37 atoms
Cl 1.067312 -3.979992 2.326579
S  -1.267485 1.543008 1.935378
O  -1.044775 -2.973451 0.431248
N  -0.342475 -0.74993 0.21995
C  0.676683 0.263004 0.381281
C  -1.659202 -0.284986 -0.170927
C  1.923336 0.190402 -0.341974
C  0.398368 1.374298 1.190931
C  -2.220926 0.800331 0.542635
C  2.932751 1.197413 -0.079183
C  1.384172 2.379388 1.425976
C  -2.396583 -0.882886 -1.214155
C  2.638215 2.270385 0.826437
C  -3.503187 1.288548 0.222969
C  2.202846 -0.83049 -1.310476
C  -0.177437 -2.093392 0.651347
C  -4.260546 0.682886 -0.812325
C  -3.689358 -0.407419 -1.518305
C  4.193894 1.114021 -0.75571
C  3.436535 -0.87434 -1.964653
C  4.448038 0.095036 -1.675965
C  1.125344 -2.350051 1.430121
C  -5.637086 1.213636 -1.171967
H  1.141938 3.228787 2.072254
H  -1.97134 -1.734055 -1.751054
H  3.405426 3.028772 1.019378
H  -3.915642 2.139185 0.77714
H  1.425128 -1.560429 -1.559142
H  -4.264882 -0.891837 -2.31517
H  4.955799 1.873658 -0.544907
H  3.630225 -1.652503 -2.710658
H  5.413691 0.04156 -2.189492
H  1.292511 -1.572555 2.190783
H  1.997044 -2.400499 0.761387
H  -6.2627 0.429197 -1.631755
H  -6.169074 1.59801 -0.284088
H  -5.56506 2.046191 -1.898488
