program: Gaussian 09
title: 000251333
version: EM64L-G09RevD.01
frameworkgroup: C1[X(C15H15NO2)]
method: RPBEPBE
basis: SDD
operation: Freq
keyword: #p
keyword: freq=noraman
keyword: PBEPBE/SDD
title: #p freq=noraman PBEPBE/SDD
converged: YES YES NO NO
title: Mulliken charges:
elementType: O O N C C C C C C C C C C C C C C C H H H H H H H H H H H H H H H
charge: -0.285610 -0.245878 -0.245190 -0.413619 0.449228 0.184815 -0.672013 -0.329705 -0.376211 -0.289786 -0.227265 -0.236001 -0.251141 -0.290476 0.350600 -0.386812 -0.254736 -0.164790 0.243372 0.233314 0.246735 0.231130 0.217539 0.284650 0.234878 0.249845 0.225372 0.223168 0.227938 0.282275 0.264268 0.257307 0.262801
chargesum: 0.00000
title: Mulliken charges with hydrogens summed into heavy atoms:
elementType: O O N C C C C C C C C C C C C C C C
charge: -0.285610 -0.245878 -0.245190 0.063067 0.449228 0.184815 0.023391 -0.045055 -0.141333 -0.039941 -0.001893 -0.012833 -0.023204 -0.008201 0.350600 -0.122544 0.002571 0.098011
polarizability: 3.71710601e+02 3.90362732e+00 1.68631969e+02 4.24167792e-01 -3.96942609e+00 8.72569751e+01
1716.lowfreq: -8.8987 -3.9280 -0.0008 -0.0005 0.0006 7.7854 27.3786 35.6406 49.1511
frequency: 27.2895 35.6170 49.0458 56.0491 103.8237 106.7777 129.4834 142.0552 185.8342 204.4049 232.0385 265.3718 298.4245 320.2999 329.4333 378.5380 407.7489 441.6985 489.0931 522.7960 578.9116 585.8597 606.2383 615.0503 635.3127 691.8244 695.6126 703.3205 735.7945 762.1902 775.8246 813.2293 816.8287 829.5435 868.7670 872.7868 874.8885 886.1926 902.5145 904.0423 957.2537 962.7925 984.8136 987.6906 990.3754 1017.7192 1030.8125 1051.5006 1079.5994 1088.8223 1110.7506 1118.0968 1133.6017 1173.3787 1180.3873 1197.6057 1204.6304 1243.2148 1252.2596 1273.6606 1304.9374 1325.8229 1340.8501 1364.1727 1371.8641 1382.5151 1391.8080 1440.9416 1465.1307 1469.8870 1483.7166 1488.9158 1514.7705 1537.3606 1547.2833 1588.6188 1609.5694 1652.3062 2988.2901 3022.1999 3070.5088 3085.4625 3097.2810 3125.9774 3127.4653 3136.7628 3154.5736 3166.6856 3177.5197 3206.7443 3220.6436 3235.3891 3266.3487
redmass: 5.3675 4.1467 4.2019 4.5520 5.1638 5.1500 3.2600 4.2906 1.7259 1.5555 5.0661 5.0502 4.1802 4.8591 3.3068 3.0467 3.0316 4.0793 4.1889 3.3706 4.1997 3.0005 4.6076 6.2103 4.1125 1.8877 5.8464 5.7352 1.2670 1.8913 1.6154 1.9988 1.3468 1.2731 6.4758 1.9049 3.9424 1.4315 1.7007 2.3837 2.4765 1.3956 1.8725 2.5061 1.1469 1.6136 2.2687 2.5034 2.3430 1.7037 1.8446 2.5039 1.5839 1.0685 1.6528 1.1942 2.2443 1.8251 1.8790 2.7134 1.4064 1.3506 1.3559 2.0793 2.3842 6.4023 1.2223 2.3791 1.0697 4.8101 1.8812 1.1464 1.0960 8.1132 5.8613 6.3710 6.0783 6.7523 1.0361 1.0641 1.0992 1.0982 1.1016 1.0848 1.0902 1.0898 1.0938 1.0991 1.0901 1.0944 1.0923 1.0981 1.1086
irintensity: 0.6200 1.3375 1.6217 1.8361 0.2628 0.6759 0.9622 0.8295 0.5759 0.5921 1.2813 0.4525 3.6741 7.0857 2.9832 0.9686 0.4102 2.9696 4.1505 9.9514 6.7862 9.2007 26.6276 4.0972 0.3945 43.0073 4.4749 6.6584 85.0304 62.6934 36.6146 3.7743 34.5774 2.2467 9.9736 9.1152 9.8511 1.6316 2.6365 1.5739 4.6557 0.9503 0.3561 0.0356 46.8952 29.6948 9.8673 60.5963 13.5940 6.9603 138.9664 14.0545 9.0021 1.0775 23.6472 4.8339 74.3791 139.3907 48.5764 59.1802 7.7761 5.7376 46.5897 90.6203 182.8849 7.4462 24.6066 14.7230 4.1053 19.5350 107.0163 32.5421 19.7765 126.3610 64.3128 9.2969 59.1007 116.8622 20.5964 27.2123 1.3798 39.5486 43.4899 2.3029 0.2656 14.2863 41.3246 24.2071 10.8804 1.6058 5.5094 0.7466 0.0597
temp: 298.150 k
press: 1.00000 atm
elementType: 8 8 7 6 6 6 6 6 6 6 6 6 6 6 6 6 6 6 1 1 1 1 1 1 1 1 1 1 1 1 1 1 1
symmnumber: 1
zpe: 689538.6 jmol-1
zpe.correction: 0.262631 hartree
zpe.thermalcorrener: 0.278931 hartree
zpe.thermalcorrenthalpy: 0.279875 hartree
zpe.thermalcorrgfe: 0.217029 hartree
zpe.sumelectzpe: -784.474989 hartree
zpe.sumelectthermal: -784.458689 hartree
zpe.sumelectthermalent: -784.457744 hartree
zpe.sumelectthermalfe: -784.520591 hartree
dipole: -2.4257 3.0143 -0.9536
dipole: 3.9849
quadrupole: -78.9503 -98.2113 -110.9278
quadrupole: 3.9897 -0.5724 0.4725
quadrupole: 17.0795 -2.1815 -14.8980 3.9897 -0.5724 0.4725
hfenergy: -784.7376199 hartree
pointgroup: C01 [X(C15H15N1O2)]
dipole: -0.9362996 -1.1359509 0.5393288 debye
polarizability: 371.6872234|1.2795205|165.3910131|5.1448645|-16.2132756|90.5213087 unknown
InChI: InChI=1S/C15H15NO2/c1-2-16(13-7-4-3-5-8-13)15(17)11-10-14-9-6-12-18-14/h3-12H,2H2,1H3
charge 0 multiplicity 1
33 atoms
O  0.384035 1.533738 -0.776991
O  -4.024786 -0.845041 0.376176
N  1.241764 -0.40332 0.253964
C  0.981716 -1.752664 0.837761
C  2.620742 0.007524 0.112764
C  0.178328 0.416123 -0.197489
C  0.651242 -2.842805 -0.204946
C  3.005776 1.372332 0.225674
C  3.631608 -0.971681 -0.0933
C  -1.211807 -0.073003 0.026214
C  4.366002 1.733592 0.136457
C  4.990071 -0.598595 -0.177357
C  5.368853 0.757133 -0.064086
C  -2.262292 0.682226 -0.427478
C  -3.656703 0.357875 -0.287861
C  -4.821105 1.016589 -0.691999
C  -5.945021 0.216091 -0.276116
C  -5.42621 -0.899554 0.365179
H  1.878993 -2.036591 1.412019
H  0.165529 -1.672935 1.576913
H  -0.259575 -2.59015 -0.774973
H  1.472827 -2.96988 -0.931167
H  0.482777 -3.811939 0.300254
H  2.244042 2.139054 0.366713
H  3.367017 -2.026788 -0.210925
H  -1.415298 -1.011894 0.545936
H  4.641449 2.790232 0.228718
H  5.749414 -1.371677 -0.340749
H  6.422668 1.047748 -0.133021
H  -2.025301 1.61985 -0.946919
H  -4.855553 1.96475 -1.225564
H  -6.999246 0.436002 -0.430801
H  -5.867653 -1.770939 0.841204
