program: Gaussian 09
title: 000251336
version: EM64L-G09RevD.01
frameworkgroup: C1[X(C15H17NO2)]
method: RPBEPBE
basis: SDD
operation: Freq
keyword: #p
keyword: freq=noraman
keyword: PBEPBE/SDD
title: #p freq=noraman PBEPBE/SDD
converged: YES YES NO NO
title: Mulliken charges:
elementType: O O N C C C C C C C C C C C C C C C H H H H H H H H H H H H H H H H H
charge: -0.251317 -0.247178 -0.258982 -0.391686 -0.341733 -0.339571 0.498189 0.112976 -0.696853 -0.330068 -0.385101 0.186286 -0.220494 -0.221594 -0.327177 -0.248494 -0.264821 -0.160445 0.242622 0.208041 0.222642 0.206040 0.191139 0.198424 0.213361 0.215869 0.214476 0.257914 0.230532 0.227117 0.224879 0.286225 0.229169 0.257468 0.262144
chargesum: 0.00000
title: Mulliken charges with hydrogens summed into heavy atoms:
elementType: O O N C C C C C C C C C C C C C C C
charge: -0.251317 -0.247178 -0.258982 0.058977 0.086949 0.049992 0.498189 0.112976 -0.053147 -0.072154 -0.154569 0.186286 0.006623 0.003285 -0.040952 -0.019325 -0.007353 0.101699
polarizability: 2.53590478e+02 -4.13061513e+00 1.59813204e+02 1.11740985e+00 -1.12932713e+01 1.21831834e+02
1716.lowfreq: -11.8399 -9.0039 -3.8710 -0.0005 -0.0004 0.0003 5.8722 31.0231 39.3922
frequency: -10.6941 30.8449 39.3600 48.4479 64.5297 69.9048 111.4504 119.6949 162.9719 195.7184 196.3722 226.2007 239.4101 283.1324 339.5352 357.8701 388.5874 404.8347 451.9948 458.1380 518.9359 575.3447 587.6648 606.7009 615.1027 687.4360 696.9376 719.0372 734.3976 735.9933 760.9006 773.8827 802.9913 835.6481 839.6139 870.2307 877.4382 899.6005 900.4149 910.4703 931.1683 966.6557 987.0599 990.4340 998.6736 1011.7169 1024.4414 1031.7942 1059.8330 1072.9564 1086.2663 1113.4101 1122.2552 1134.0815 1172.4257 1179.9911 1188.8282 1200.6418 1217.3803 1243.9408 1264.9340 1281.1488 1288.2111 1318.4002 1340.7057 1358.2538 1360.6059 1369.0185 1383.8491 1390.3595 1439.3021 1463.8090 1467.3956 1473.2565 1475.7955 1483.1613 1485.6306 1493.5011 1537.5293 1561.0279 1594.2272 1610.3589 2962.0750 2974.4259 2987.7658 3006.4486 3013.4430 3052.0640 3071.8311 3073.4281 3103.9368 3127.3401 3137.1369 3150.4642 3163.4048 3177.9331 3224.8892 3246.3010 3264.6800
redmass: 4.0153 3.9230 4.2670 5.4204 4.2938 1.6639 3.2610 3.2245 4.6679 5.0220 5.3061 1.1333 3.6073 5.3154 5.7160 3.1099 3.1205 2.8599 4.5029 5.7397 3.8815 5.3455 3.0735 5.6387 6.1990 4.2935 1.8498 4.9905 1.1083 1.3067 2.5818 1.5977 1.8478 1.2619 1.3362 5.9395 4.0441 1.6947 1.4066 1.4540 1.2768 1.3796 2.0648 2.2630 2.0163 2.8698 3.0719 2.3778 2.6569 2.4472 1.6505 2.3717 1.9983 1.6378 1.0535 3.2531 1.1594 1.6481 1.8672 2.3556 1.3219 1.4779 1.0704 1.3418 1.3974 1.4803 2.3613 3.0075 6.9580 1.2128 2.3461 2.0417 1.4816 1.1024 1.0423 2.2661 1.0907 1.1392 8.6608 6.2420 6.4158 6.1732 1.0588 1.0363 1.0609 1.0970 1.0707 1.0996 1.1005 1.0995 1.0960 1.0847 1.0887 1.0937 1.0982 1.0979 1.0911 1.0988 1.1096
irintensity: 0.4421 0.0405 0.4818 3.1778 1.0446 0.2104 0.6810 1.0533 3.9486 1.8023 0.8902 0.0877 1.4548 0.1811 7.3313 1.4396 4.6507 0.5270 2.0663 4.5469 6.6839 9.3842 7.5314 1.4248 0.2957 6.3364 53.0706 15.2245 17.7823 85.2304 17.0653 26.2673 13.3047 2.2173 23.0543 5.9267 32.7528 7.0928 2.6549 3.1763 19.4841 0.2550 0.3516 0.2532 13.5218 23.5845 1.2738 15.1514 69.3153 0.5770 10.0618 12.1683 22.9749 48.3464 0.0652 2.8626 0.7905 15.0954 33.1508 17.2304 2.3698 106.7728 2.7314 3.6920 1.4247 12.5922 17.3648 201.4290 16.9079 10.2202 6.5015 34.0459 28.2623 5.0896 13.0512 67.3623 6.8296 20.4161 186.8296 48.7172 9.3968 27.8022 31.8301 32.8325 22.6400 13.2684 30.2216 14.3207 69.0126 51.4051 21.1259 2.1152 7.0403 34.2821 28.9092 3.7861 3.0416 0.9892 0.3864
temp: 298.150 k
press: 1.00000 atm
elementType: 8 8 7 6 6 6 6 6 6 6 6 6 6 6 6 6 6 6 1 1 1 1 1 1 1 1 1 1 1 1 1 1 1 1 1
symmnumber: 1
zpe: 747963.6 jmol-1
zpe.correction: 0.284884 hartree
zpe.thermalcorrener: 0.301165 hartree
zpe.thermalcorrenthalpy: 0.302110 hartree
zpe.thermalcorrgfe: 0.239334 hartree
zpe.sumelectzpe: -785.655232 hartree
zpe.sumelectthermal: -785.638950 hartree
zpe.sumelectthermalent: -785.638006 hartree
zpe.sumelectthermalfe: -785.700782 hartree
dipole: 1.6802 3.1773 -0.5490
dipole: 3.6359
quadrupole: -85.3538 -113.4016 -103.9141
quadrupole: -2.9232 0.1703 -2.8204
quadrupole: 15.5360 -12.5118 -3.0243 -2.9232 0.1703 -2.8204
hfenergy: -785.9401159 hartree
pointgroup: C01 [X(C15H17N1O2)]
dipole: -0.5613209 -1.3067906 -0.1532646 debye
polarizability: 253.6213368|3.2697352|160.6797653|-3.0430444|9.3882678|120.9344141 unknown
InChI: InChI=1S/C15H17NO2/c1-2-3-11-16(13-8-5-4-6-9-13)15(17)14-10-7-12-18-14/h4-10,12H,2-3,11H2,1H3
charge 0 multiplicity 1
35 atoms
O  -2.702936 -0.333901 0.232135
O  -0.355076 2.441085 -0.036973
N  0.215275 0.189657 -0.382501
C  -0.157256 -1.187105 -0.812632
C  -0.045571 -2.231779 0.318646
C  -0.380402 -3.655234 -0.181002
C  1.6269 0.472692 -0.204395
C  -0.709852 1.225265 -0.177317
C  -0.254798 -4.718274 0.931431
C  2.074304 1.143438 0.962256
C  2.573484 0.059418 -1.173919
C  -2.168583 0.93372 -0.1323
C  3.44901 1.388683 1.154593
C  3.950849 0.300968 -0.97156
C  -3.217943 1.832026 -0.293669
C  4.39661 0.964963 0.192812
C  -4.446657 1.120176 -0.041595
C  -4.097807 -0.182466 0.278752
H  -1.182946 -1.17075 -1.210254
H  0.504775 -1.481687 -1.648106
H  -0.735214 -1.950495 1.136517
H  0.981747 -2.216113 0.733462
H  0.294158 -3.920311 -1.021472
H  -1.41115 -3.667407 -0.590923
H  -0.936378 -4.493477 1.773149
H  -0.502022 -5.728148 0.555767
H  0.774948 -4.74952 1.334132
H  1.345112 1.482489 1.702737
H  2.243661 -0.429363 -2.096443
H  3.780987 1.909622 2.059442
H  4.671493 -0.021485 -1.73137
H  -3.094807 2.881866 -0.548405
H  5.464373 1.154692 0.346986
H  -5.456534 1.522726 -0.085432
H  -4.657554 -1.07247 0.55375
