program: Gaussian 09
title: 000251310
version: EM64L-G09RevD.01
frameworkgroup: C1[X(C13H16O3)]
method: RPBEPBE
basis: SDD
operation: Freq
keyword: #pfreq=noraman
keyword: PBEPBE/SDD
title: #p freq=noraman PBEPBE/SDD
converged: YES YES NO NO
title: Mulliken charges:
elementType: O O O C C C C C C C C C C C C C H H H H H H H H H H H H H H H H
charge: -0.187900 -0.284701 -0.213288 -0.043888 -0.496374 -0.705075 -0.692042 0.220317 -0.629496 0.238164 0.394048 -0.399831 -0.320796 -0.195122 -0.210347 -0.246678 0.212586 0.236740 0.214975 0.231837 0.203184 0.221438 0.250708 0.211452 0.205931 0.274101 0.263031 0.254963 0.301299 0.230871 0.229645 0.230249
chargesum: 0.00000
title: Mulliken charges with hydrogens summed into heavy atoms:
elementType: O O O C C C C C C C C C C C C C
charge: -0.187900 -0.284701 -0.213288 0.168698 -0.044658 -0.048616 -0.023952 0.220317 -0.092365 0.238164 0.394048 -0.144868 -0.019497 0.035749 0.019298 -0.016429
polarizability: 2.05478397e+02 6.83180231e+00 1.35325532e+02 -1.54621227e+01 9.22141847e+00 1.05431566e+02
1716.lowfreq: -11.1500 -0.0003 0.0005 0.0005 2.3454 10.4052 14.0238 21.7223 25.1882
frequency: 8.4684 21.5353 24.9804 42.5698 73.7590 85.7940 126.1781 162.1846 188.3533 206.7543 245.3652 262.4502 271.3473 324.4391 332.7126 352.9361 387.4379 409.1417 427.2518 491.1629 504.4746 510.9063 569.1224 607.6374 639.4919 693.0776 716.5279 745.8779 765.8887 779.7820 827.7790 843.7856 893.2423 909.5062 915.7702 923.7102 927.8044 960.5111 965.3920 976.7024 987.2269 995.2489 1022.9694 1035.3876 1080.3682 1085.3184 1114.8754 1147.3997 1154.5492 1170.4851 1182.1509 1191.7783 1219.6629 1231.7729 1257.6445 1274.5691 1312.5519 1327.8098 1347.2060 1383.1669 1383.7760 1402.5706 1419.7653 1442.9178 1454.2755 1466.8940 1470.5034 1472.3356 1486.5202 1489.2615 1591.1315 1608.5643 1626.5132 1654.3835 2969.3292 2970.4730 2981.5340 2994.7538 3014.2641 3057.6327 3063.2860 3071.5161 3075.1854 3080.9310 3089.2066 3132.7315 3144.4689 3160.7389 3174.0587 3211.4206
redmass: 4.6051 4.1787 4.9302 3.8502 7.8207 3.1780 6.3465 4.4406 4.2060 1.1620 3.0691 5.6912 1.0653 5.4982 2.7823 2.2345 2.1229 2.9312 2.7251 3.7449 3.9323 3.4079 4.4587 6.4159 3.8853 2.2611 5.5304 6.1567 1.5359 3.2573 3.3699 1.2534 2.6815 1.9368 2.4375 1.4012 1.4506 1.7021 1.9124 1.3643 6.1897 1.3053 2.1486 1.9102 1.5397 1.5292 1.8339 2.5503 2.2741 1.0692 2.1821 1.3763 1.8062 1.2101 1.4774 1.6079 1.3250 1.4925 1.3860 1.2170 9.4325 1.2128 1.1292 2.2746 1.1040 1.0459 2.1848 1.0615 1.0455 1.0535 6.3631 6.4858 8.4254 10.6041 1.0368 1.0787 1.0374 1.0619 1.0600 1.1032 1.1004 1.0997 1.0990 1.1001 1.0992 1.0853 1.0904 1.0952 1.0994 1.0948
irintensity: 1.4753 0.3987 1.5295 0.9851 0.4711 0.4871 1.9180 8.6638 0.4363 0.1158 0.9113 0.2365 0.1537 1.1039 4.0908 0.3447 0.4766 0.0509 0.3491 10.3641 23.0200 5.1012 0.6988 1.2272 12.5661 30.8641 2.6864 6.2510 93.1107 0.5876 6.3011 0.0426 13.2001 37.5933 12.3252 8.8798 10.0443 0.2413 1.7668 0.0727 2.2427 1.3497 16.9314 14.3249 53.1239 152.5098 129.3620 93.8125 75.7572 4.0589 68.3668 43.8053 296.3477 9.7435 6.6702 168.2729 1.0727 1.7002 7.6746 24.2935 7.4324 17.5027 32.3961 9.0914 5.6182 3.3195 83.1138 3.1838 23.6857 13.8876 19.5065 12.5843 136.3199 142.6582 26.9284 21.4790 30.5641 26.3704 8.6543 4.4940 47.1816 15.8858 66.4941 0.3474 40.1897 0.0132 16.8876 27.6056 10.4172 3.8665
temp: 298.150 k
press: 1.00000 atm
elementType: 8 8 8 6 6 6 6 6 6 6 6 6 6 6 6 6 1 1 1 1 1 1 1 1 1 1 1 1 1 1 1 1
symmnumber: 1
zpe: 680704.4 jmol-1
zpe.correction: 0.259267 hartree
zpe.thermalcorrener: 0.275731 hartree
zpe.thermalcorrenthalpy: 0.276675 hartree
zpe.thermalcorrgfe: 0.211347 hartree
zpe.sumelectzpe: -729.451518 hartree
zpe.sumelectthermal: -729.435054 hartree
zpe.sumelectthermalent: -729.434109 hartree
zpe.sumelectthermalfe: -729.499438 hartree
dipole: 1.3854 -1.6671 -2.3747
dipole: 3.2152
quadrupole: -72.8098 -93.7694 -98.0117
quadrupole: -0.6470 -7.0002 5.0044
quadrupole: 15.3871 -5.5724 -9.8147 -0.6470 -7.0002 5.0044
hfenergy: -729.7107847 hartree
pointgroup: C01 [X(C13H16O3)]
dipole: 0.5548211 0.4361372 -1.0498032 debye
polarizability: 206.102175|14.750089|104.8795487|-2.1083101|9.3895634|135.253771 unknown
InChI: InChI=1S/C13H16O3/c1-10(2)8-11(14)9-13(15)16-12-6-4-3-5-7-12/h3-7,10H,8-9H2,1-2H3
charge 0 multiplicity 1
32 atoms
O  1.679648 -1.215114 -0.003474
O  -1.004134 0.549312 -0.786747
O  -0.030005 1.515051 1.133654
C  4.679765 -0.045793 -0.147193
C  3.553881 -0.234934 -1.226078
C  4.520729 1.276779 0.641871
C  4.778076 -1.258348 0.806765
C  2.146046 -0.235246 -0.636738
C  1.320004 1.053325 -0.864991
C  0.051348 1.088444 -0.035802
C  -2.337718 0.341717 -0.306913
C  -3.214307 -0.141916 -1.303758
C  -2.777525 0.569253 1.01796
C  -4.560225 -0.402715 -0.974112
C  -4.131564 0.299728 1.326954
C  -5.02497 -0.181937 0.344371
H  5.62573 0.014455 -0.724709
H  3.714066 -1.210381 -1.723332
H  3.645789 0.565195 -1.984871
H  3.622626 1.256531 1.287753
H  4.444744 2.15126 -0.032664
H  5.394503 1.437306 1.299158
H  3.844633 -1.393842 1.380201
H  4.963599 -2.194496 0.248915
H  5.607699 -1.114694 1.523716
H  1.082242 1.113352 -1.943244
H  1.947873 1.923443 -0.60427
H  -2.828315 -0.309954 -2.313613
H  -2.090372 0.943213 1.776972
H  -5.241858 -0.779295 -1.74432
H  -4.483541 0.470491 2.350292
H  -6.070068 -0.384995 0.60125
