program: Gaussian 09
title: 000251290
version: EM64L-G09RevD.01
frameworkgroup: C1[X(C12H15NO)]
method: RPBEPBE
basis: SDD
operation: Freq
keyword: #p
keyword: freq=noraman
keyword: PBEPBE/SDD
title: #p freq=noraman PBEPBE/SDD
converged: YES YES NO NO
title: Mulliken charges:
elementType: O N C C C C C C C C C C C C H H H H H H H H H H H H H H H
charge: -0.276075 -0.224066 -0.092313 -0.438447 -0.537227 0.317690 0.252539 -0.707689 0.203927 -0.382448 -0.342758 -0.259639 -0.249834 -0.820006 0.241853 0.209894 0.227547 0.229154 0.231959 0.222593 0.247860 0.216984 0.228322 0.302510 0.226607 0.226920 0.271279 0.238020 0.234847
chargesum: 0.00000
title: Mulliken charges with hydrogens summed into heavy atoms:
elementType: O N C C C C C C C C C C C C
charge: -0.276075 -0.224066 0.149539 -0.001006 -0.076114 0.317690 0.252539 -0.020253 0.203927 -0.154127 -0.040249 -0.033032 -0.022914 -0.075859
polarizability: 1.75347630e+02 8.69872345e-02 1.48917998e+02 2.37353216e+00 -5.11181752e+00 8.39074116e+01
1716.lowfreq: -14.3129 -10.8971 -7.5556 -0.0006 -0.0002 0.0001 37.3473 70.2864 94.2587
frequency: 37.1557 70.2278 94.2237 142.3906 192.2733 225.0983 239.3058 244.2556 273.4858 321.5779 358.9990 368.5043 421.9098 441.4621 454.9686 514.7465 522.5316 545.8292 563.8444 599.8680 642.3060 680.2120 718.7077 765.1401 775.7592 836.2355 854.3037 867.1378 923.9721 939.6755 952.3861 984.1976 985.9194 1012.2922 1027.8876 1030.4601 1051.1760 1073.8804 1103.0725 1123.3045 1150.1979 1172.4692 1192.7151 1202.9999 1221.0608 1230.7088 1289.5219 1295.5278 1312.1833 1345.3444 1358.9851 1372.2964 1379.3196 1386.0021 1390.7840 1441.3825 1456.0531 1458.7482 1461.8782 1469.9430 1481.1978 1484.9589 1492.1824 1581.8761 1588.2291 1614.2434 2968.4684 2985.8720 2987.3190 2995.7174 3028.2289 3057.2394 3074.9003 3080.5979 3081.1567 3102.3431 3111.6302 3125.8980 3134.3122 3158.2079 3211.3300
redmass: 4.2072 3.4441 3.5850 3.1962 1.4456 4.2262 1.1047 1.4289 2.9042 2.6826 3.1413 5.3333 3.9509 3.2059 3.2156 4.1723 3.5190 3.8591 4.1555 3.5410 2.7906 3.2155 2.8282 1.4756 3.9134 2.1072 2.6077 1.4042 2.1655 1.8273 1.5309 1.3255 1.6944 2.0477 1.6507 2.1032 2.0444 2.3412 2.0003 1.8284 1.8479 1.2486 1.4312 1.5061 1.9997 2.3222 1.4825 2.0267 1.8277 1.6322 1.5289 1.4146 2.9958 1.3862 1.3809 2.4033 1.1246 1.0989 1.0638 1.1052 1.1617 1.3604 1.3378 6.4253 6.8993 6.6573 1.0648 1.0366 1.0384 1.0617 1.0939 1.1034 1.0981 1.0974 1.0941 1.0925 1.0878 1.0975 1.0894 1.0988 1.0936
irintensity: 2.3154 3.1225 0.5579 1.3626 0.4612 4.0422 0.3489 0.1091 2.8331 1.1208 1.8597 2.6019 3.7485 7.5605 0.4814 0.8681 1.8200 4.1108 5.7291 1.8292 11.8869 3.3919 8.8789 74.0238 6.0626 6.5888 2.5878 0.9940 1.7147 1.6434 6.6013 0.8620 20.6140 11.6397 5.1324 1.4526 9.4857 11.1227 4.6386 1.9855 23.6263 5.2927 18.9632 2.7820 54.1719 20.3129 29.0181 159.7490 84.2907 6.1905 40.7007 7.5774 8.5482 46.4470 45.3282 25.7030 20.4910 19.1167 10.4119 21.4912 15.0186 40.2463 48.0797 112.5308 98.3473 17.0685 25.0010 25.1509 9.4426 29.9589 29.2353 36.9149 16.9360 22.3407 7.9096 45.0137 11.7739 9.9186 16.1654 32.5461 5.5211
temp: 298.150 k
press: 1.00000 atm
elementType: 8 7 6 6 6 6 6 6 6 6 6 6 6 6 1 1 1 1 1 1 1 1 1 1 1 1 1 1 1
symmnumber: 1
zpe: 639492.0 jmol-1
zpe.correction: 0.243570 hartree
zpe.thermalcorrener: 0.256266 hartree
zpe.thermalcorrenthalpy: 0.257210 hartree
zpe.thermalcorrgfe: 0.204660 hartree
zpe.sumelectzpe: -595.233495 hartree
zpe.sumelectthermal: -595.220799 hartree
zpe.sumelectthermalent: -595.219855 hartree
zpe.sumelectthermalfe: -595.272405 hartree
dipole: -1.0696 4.4939 0.6532
dipole: 4.6654
quadrupole: -73.6431 -86.6386 -85.7747
quadrupole: -4.6752 -0.6544 -3.9156
quadrupole: 8.3757 -4.6198 -3.7559 -4.6752 -0.6544 -3.9156
hfenergy: -595.477065 hartree
pointgroup: C01 [X(C12H15N1O1)]
dipole: 0.4239565 -1.7742468 0.2035433 debye
polarizability: 175.3965878|0.1525085|148.5020213|-1.0681489|7.2814016|84.2744304 unknown
InChI: InChI=1S/C12H15NO/c1-9-7-8-11-5-3-4-6-12(11)13(9)10(2)14/h3-6,9H,7-8H2,1-2H3
charge 0 multiplicity 1
29 atoms
O  1.548536 2.442494 -0.250266
N  1.018976 0.163647 0.045641
C  1.531137 -1.24039 0.175302
C  0.799515 -2.138878 -0.847269
C  -0.706556 -2.182404 -0.54619
C  -1.261485 -0.803616 -0.209316
C  -0.422086 0.322683 0.066069
C  1.409856 -1.738303 1.634126
C  1.919597 1.240356 -0.0834
C  -2.666846 -0.641757 -0.151906
C  -1.027651 1.571211 0.389426
C  -3.263563 0.592635 0.168806
C  -2.428919 1.699942 0.440311
C  3.42048 0.929988 -0.019545
H  2.595202 -1.229067 -0.100529
H  1.232834 -3.156094 -0.82009
H  0.974541 -1.728213 -1.859819
H  -0.899405 -2.870679 0.301769
H  -1.256376 -2.602713 -1.409136
H  2.02591 -1.118333 2.30978
H  0.367686 -1.688149 1.993022
H  1.75614 -2.785225 1.713528
H  -3.2990 -1.512303 -0.369732
H  -0.394403 2.437355 0.575179
H  -4.353931 0.690572 0.20292
H  -2.86501 2.673345 0.690852
H  3.936303 1.901383 -0.00086
H  3.768603 0.37399 -0.909941
H  3.707317 0.357626 0.880671
