program: Gaussian 09
title: 000251280
version: EM64L-G09RevD.01
frameworkgroup: C1[X(C11H12F3NO)]
method: RPBEPBE
basis: SDD
operation: Freq
keyword: #p
keyword: freq=noraman
keyword: PBEPBE/SDD
title: #p freq=noraman PBEPBE/SDD
converged: YES YES NO NO
title: Mulliken charges:
elementType: F F F O N C C C C C C C C C C C H H H H H H H H H H H H
charge: -0.163774 -0.171429 -0.166134 -0.247712 -0.469471 -0.525584 -0.346931 0.520702 0.220266 0.342780 -0.575350 -0.345705 -0.680531 -0.374050 -0.196919 0.254214 0.206551 0.237577 0.244286 0.206815 0.310639 0.254013 0.318010 0.207288 0.226251 0.211187 0.264603 0.238407
chargesum: 0.00000
title: Mulliken charges with hydrogens summed into heavy atoms:
elementType: F F F O N C C C C C C C C C C C
charge: -0.163774 -0.171429 -0.166134 -0.247712 -0.158832 -0.081455 0.104170 0.520702 0.220266 0.342780 -0.321336 -0.027695 -0.035805 -0.109447 0.041488 0.254214
polarizability: 1.99523965e+02 -7.16741499e+00 1.31001208e+02 -3.87106706e+00 4.08314870e+00 7.50868417e+01
1716.lowfreq: -10.8990 -4.0538 -3.1503 -0.0009 -0.0008 0.0007 12.0739 20.1218 44.3261
frequency: 11.6236 20.0690 44.1924 64.4750 72.5266 113.6355 130.5944 159.5719 215.6638 232.5158 240.4854 265.9773 299.8611 305.8357 341.7162 372.6797 395.0097 428.7617 485.8678 516.5162 544.8767 607.8590 612.4586 624.8829 659.7818 689.8589 697.9342 740.7912 758.4951 814.9581 843.8783 879.2152 892.3188 894.9329 936.5779 953.2835 983.4496 984.0405 1007.5958 1011.7894 1057.1793 1059.5980 1084.4881 1101.9234 1105.9001 1175.2570 1185.4004 1225.3050 1239.1712 1277.6279 1300.8476 1304.1744 1319.5657 1347.5895 1383.4196 1393.6473 1418.8988 1447.2064 1475.6228 1479.5001 1483.5141 1486.1642 1515.9774 1600.0378 1620.2397 1630.7142 2970.1773 2974.7189 2995.0800 3023.5379 3051.2731 3078.3549 3078.7724 3136.6144 3150.7236 3175.9667 3196.8660 3528.9168
redmass: 11.5007 2.8515 5.0266 3.4549 2.6649 4.6052 6.8155 4.6596 4.5048 1.6236 2.1792 3.8842 5.9907 6.8692 9.2008 3.3771 7.7774 5.1615 4.5345 9.1275 4.2839 9.6416 4.3105 2.9583 1.5949 7.3068 2.1556 1.3277 3.4264 1.3891 3.1370 1.5624 1.6577 2.1693 1.3882 4.7574 7.5814 8.1457 1.4159 4.6099 3.4548 2.6229 1.5379 1.9893 1.8444 2.3219 1.0947 1.5041 1.5631 1.2409 1.2874 3.1011 1.6073 1.5166 4.3040 1.2158 3.7370 1.1060 1.0494 1.0448 2.8666 1.0852 2.2051 6.6568 5.4638 5.1909 1.0584 1.0367 1.0641 1.0978 1.1001 1.0988 1.1022 1.0921 1.0886 1.0958 1.0958 1.0765
irintensity: 0.2041 0.1360 5.9109 0.6304 1.8527 4.6317 0.4818 3.1817 5.3590 0.8918 2.6346 1.3392 1.1353 0.7487 6.0810 2.8721 3.5870 0.4184 9.0326 1.6648 14.0499 12.4969 12.9470 9.7081 35.5121 1.2443 35.5320 5.6924 7.7483 64.2164 17.9968 9.1216 55.7869 17.0369 1.5137 19.8069 115.1270 119.3126 16.5319 138.0543 97.6666 79.6250 5.1432 8.5438 6.6344 124.3731 1.2247 36.6109 49.8142 22.1524 13.6725 197.3452 121.6277 12.6360 91.6994 7.5581 9.0561 12.0951 9.2095 12.7674 225.8917 17.0996 310.3864 13.0353 71.4204 78.9832 14.7979 40.0494 24.8545 13.5854 0.2814 44.1624 69.7230 4.6636 7.4082 3.2215 8.5862 13.1118
temp: 298.150 k
press: 1.00000 atm
elementType: 9 9 9 8 7 6 6 6 6 6 6 6 6 6 6 6 1 1 1 1 1 1 1 1 1 1 1 1
symmnumber: 1
zpe: 555883.9 jmol-1
zpe.correction: 0.211725 hartree
zpe.thermalcorrener: 0.227491 hartree
zpe.thermalcorrenthalpy: 0.228435 hartree
zpe.thermalcorrgfe: 0.165185 hartree
zpe.sumelectzpe: -854.711407 hartree
zpe.sumelectthermal: -854.695641 hartree
zpe.sumelectthermalent: -854.694697 hartree
zpe.sumelectthermalfe: -854.757947 hartree
dipole: 3.1703 -1.2587 -0.3327
dipole: 3.4272
quadrupole: -101.7018 -90.2262 -96.2545
quadrupole: -17.2631 -0.4040 1.7252
quadrupole: -5.6409 5.8346 -0.1937 -17.2631 -0.4040 1.7252
hfenergy: -854.9231322 hartree
pointgroup: C01 [X(C11H12F3N1O1)]
dipole: 1.2388696 0.5210328 0.1086462 debye
polarizability: 198.903776|8.4928684|131.1100431|8.1137848|-3.9782978|75.5981954 unknown
InChI: InChI=1S/C11H12F3NO/c1-2-4-10(16)15-9-6-3-5-8(7-9)11(12,13)14/h3,5-7,15H,2,4H2,1H3
charge 0 multiplicity 1
28 atoms
F  -4.65692 0.225904 0.222299
F  -3.326301 2.068694 0.222825
F  -3.755669 0.977114 -1.713166
O  2.894027 -1.446657 0.495565
N  1.412934 0.353474 0.214505
C  3.823103 0.823357 0.463344
C  5.043669 0.398894 -0.390213
C  0.157628 -0.308967 0.138472
C  2.687484 -0.202368 0.390665
C  -2.270386 -0.098578 -0.104563
C  -0.996399 0.499273 -0.025602
C  0.018486 -1.722313 0.21922
C  6.250138 1.337772 -0.186988
C  -2.420985 -1.502605 -0.024049
C  -1.26714 -2.297291 0.139894
C  -3.473734 0.770077 -0.329396
H  3.479669 1.833947 0.164598
H  4.140163 0.892428 1.523783
H  5.309919 -0.638112 -0.116825
H  4.755016 0.379729 -1.459199
H  1.379535 1.37255 0.135015
H  -0.906324 1.590589 -0.079472
H  0.910503 -2.338029 0.34538
H  6.004776 2.380327 -0.46499
H  7.107593 1.018271 -0.806097
H  6.579513 1.339081 0.869266
H  -3.41472 -1.955916 -0.077696
H  -1.367076 -3.385348 0.20772
