program: Gaussian 09
title: 000251266
version: EM64L-G09RevD.01
frameworkgroup: C1[X(C9H18O2)]
method: RPBEPBE
basis: SDD
operation: Freq
keyword: #pfreq=noraman
keyword: PBEPBE/SDD
title: #p freq=noraman PBEPBE/SDD
converged: YES YES NO NO
title: Mulliken charges:
elementType: O O C C C C C C C C C H H H H H H H H H H H H H H H H H H
charge: -0.435133 -0.201726 -0.050006 -0.487312 -0.519309 -0.063241 0.180279 -0.384887 -0.694122 -0.697389 -0.681117 0.191493 0.243948 0.228834 0.231958 0.209677 0.242460 0.191993 0.211776 0.208597 0.230005 0.214510 0.213805 0.213484 0.215517 0.228665 0.216069 0.217010 0.324162
chargesum: 0.00000
title: Mulliken charges with hydrogens summed into heavy atoms:
elementType: O O C C C C C C C C C
charge: -0.110971 -0.201726 0.141487 -0.014530 -0.077675 0.179219 0.180279 0.018882 -0.041010 -0.054584 -0.019373
polarizability: 1.22097845e+02 1.56023416e+00 1.02138102e+02 1.75697854e+00 -2.21057812e+00 8.80706170e+01
1716.lowfreq: -19.8042 -13.6441 -0.0011 -0.0007 -0.0007 3.4544 17.1847 38.3434 54.8489
frequency: 8.7398 37.9102 54.6340 85.8551 109.2860 122.5115 162.8422 210.9995 213.6026 232.4786 253.2446 285.8651 321.6607 332.8418 371.6559 402.4324 423.2891 442.1901 467.2944 532.3632 671.1200 765.0962 785.2738 824.4262 835.3769 897.1471 910.8021 919.8981 937.1628 957.0502 963.5369 1005.4863 1040.0770 1062.9520 1085.5136 1103.8849 1121.8921 1145.2097 1171.3848 1207.8580 1225.6023 1252.3924 1259.9656 1273.4203 1304.9026 1314.4240 1323.5143 1328.9985 1342.1548 1369.7477 1381.5927 1393.3131 1399.8776 1439.7525 1444.1003 1462.2893 1466.2775 1471.1195 1473.3130 1481.7795 1486.9595 1488.2817 1615.0242 2954.9080 2959.3570 2970.9223 2974.8871 2978.6996 2985.1795 2988.8473 3021.7797 3047.2655 3058.8232 3066.1421 3069.6752 3070.2260 3074.3647 3075.2083 3079.2944 3091.2803 3531.8605
redmass: 3.4778 3.2960 3.2668 3.3197 2.3763 3.7248 2.9435 1.0572 1.3571 1.3988 1.7173 2.3227 1.1782 3.0331 2.2520 2.6374 1.9380 2.3196 2.8813 2.8729 3.5486 1.7538 2.2658 2.3164 2.7005 1.6843 1.7450 1.2085 1.9722 1.5703 1.7985 3.0819 1.7932 1.3631 2.0163 2.1253 2.0670 1.5365 1.7956 1.6655 1.3801 1.3584 1.5662 1.4477 1.2528 1.3986 1.3444 1.5102 1.4764 1.2081 1.2079 1.2065 1.2088 1.1079 1.0963 1.0787 1.0439 1.0549 1.0406 1.0494 1.0516 1.0568 8.6995 1.0644 1.0824 1.0354 1.0378 1.0575 1.0364 1.0603 1.0934 1.0891 1.1013 1.0998 1.1004 1.1003 1.0990 1.0994 1.0997 1.0997 1.0657
irintensity: 0.6819 1.7190 0.5725 1.3373 2.9695 1.1882 0.6630 0.1930 4.1181 0.0918 3.3391 4.6189 139.9361 23.8784 0.5953 3.6833 2.5443 1.2809 19.3683 28.6777 1.7678 0.8260 5.6735 9.3508 5.8406 6.6725 5.2431 8.2363 18.1811 14.1740 10.0941 14.2426 11.6777 40.2088 37.9688 18.8613 13.5839 12.0380 23.2237 12.7698 5.0260 5.0313 51.8929 38.3834 13.5951 8.7830 19.2122 30.3268 7.4357 24.7418 18.1636 17.0421 13.1224 9.4717 9.4691 7.7097 2.2121 5.2213 12.9194 13.6064 16.1074 14.9588 137.6459 29.6149 27.3525 35.3515 21.6249 12.5445 31.5688 17.8609 13.0279 9.8877 5.9688 7.9723 14.8602 27.3769 66.5536 71.6986 57.7970 36.4380 4.0236
temp: 298.150 k
press: 1.00000 atm
elementType: 8 8 6 6 6 6 6 6 6 6 6 1 1 1 1 1 1 1 1 1 1 1 1 1 1 1 1 1 1
symmnumber: 1
zpe: 666800.7 jmol-1
zpe.correction: 0.253971 hartree
zpe.thermalcorrener: 0.268293 hartree
zpe.thermalcorrenthalpy: 0.269237 hartree
zpe.thermalcorrgfe: 0.210927 hartree
zpe.sumelectzpe: -503.280055 hartree
zpe.sumelectthermal: -503.265733 hartree
zpe.sumelectthermalent: -503.264789 hartree
zpe.sumelectthermalfe: -503.323099 hartree
dipole: 0.6741 -2.6822 3.0513
dipole: 4.1182
quadrupole: -64.6401 -75.7496 -71.4274
quadrupole: 3.3150 2.5972 0.5957
quadrupole: 5.9656 -5.1439 -0.8217 3.3150 2.5972 0.5957
hfenergy: -503.5340256 hartree
pointgroup: C01 [X(C9H18O2)]
dipole: 0.165715 -1.5286556 -0.5107037 debye
polarizability: 122.0305656|-2.4540683|91.9849182|1.7258723|6.5384396|98.2910804 unknown
InChI: InChI=1S/C9H18O2/c1-4-8(10)6-9(11)5-7(2)3/h7-8,10H,4-6H2,1-3H3
charge 0 multiplicity 1
29 atoms
O  1.493749 -0.022422 -1.388396
O  -0.467184 1.541506 1.760556
C  -2.543104 -0.540027 -0.164211
C  -1.517575 0.635211 -0.247291
C  0.569205 -0.467986 0.89518
C  1.821676 -0.072945 0.054876
C  -0.490848 0.639197 0.876486
C  3.015811 -1.015144 0.324477
C  -3.361234 -0.483518 1.146925
C  -3.472321 -0.508408 -1.40029
C  4.295643 -0.593795 -0.426916
H  -1.981861 -1.498437 -0.184937
H  -0.962389 0.564019 -1.204389
H  -2.064452 1.595963 -0.221777
H  0.885592 -0.612663 1.944117
H  0.167883 -1.425057 0.508764
H  2.105904 0.968375 0.289484
H  2.727086 -2.050571 0.040678
H  3.20959 -1.034332 1.414852
H  -4.087616 -1.315939 1.193362
H  -2.71317 -0.543012 2.040213
H  -3.924999 0.466386 1.21098
H  -2.896911 -0.580372 -2.342076
H  -4.050939 0.434511 -1.428307
H  -4.193892 -1.346021 -1.373539
H  4.105071 -0.506128 -1.51095
H  5.107141 -1.327693 -0.272897
H  4.655321 0.389615 -0.071979
H  1.377324 -0.954311 -1.709997
