program: Gaussian 09
title: 000251263
version: EM64L-G09RevD.01
frameworkgroup: C1[X(C8H18O2)]
method: RPBEPBE
basis: SDD
operation: Freq
keyword: #pfreq=noraman
keyword: PBEPBE/SDD
title: #p freq=noraman PBEPBE/SDD
converged: YES YES NO NO
title: Mulliken charges:
elementType: O O C C C C C C C C H H H H H H H H H H H H H H H H H H
charge: -0.521733 -0.482762 0.362620 -0.497648 -0.007308 -0.431786 -0.745823 -0.364404 -0.708970 -0.708091 0.191840 0.232678 0.165593 0.183906 0.238147 0.218147 0.241264 0.204210 0.204733 0.179609 0.221879 0.220932 0.226891 0.345310 0.259043 0.206169 0.195732 0.369821
chargesum: 0.00000
title: Mulliken charges with hydrogens summed into heavy atoms:
elementType: O O C C C C C C C C
charge: -0.176423 -0.112941 0.362620 -0.073130 0.158285 -0.009733 -0.082202 0.019938 -0.039268 -0.047147
polarizability: 1.08872540e+02 -1.28968224e+00 9.05615175e+01 -3.12383923e-01 1.28823788e+00 8.40863802e+01
1716.lowfreq: -17.1442 -10.9329 -0.0006 -0.0005 -0.0001 10.6121 40.9521 63.8708 96.1287
frequency: 40.5983 63.5324 96.1223 138.4715 156.0885 211.3317 215.7829 235.3741 245.7084 283.1805 287.9353 297.2000 319.4522 359.7951 413.0530 452.6052 467.2732 481.4580 540.8459 625.0251 720.5610 766.1264 784.7467 817.9546 857.2488 904.0266 923.2813 954.5387 989.1849 1012.6650 1032.2252 1051.3712 1057.5787 1098.2072 1104.7340 1124.0709 1136.7842 1187.6938 1227.9614 1256.3506 1261.2175 1271.9978 1315.5311 1323.8087 1329.6510 1334.8333 1356.4846 1382.7699 1383.9557 1393.4191 1430.8325 1437.9198 1451.1092 1462.1929 1470.7071 1471.0513 1480.4324 1484.5244 1487.8743 1489.8724 2900.7104 2959.7438 2968.3892 2977.1972 2978.3737 2985.4988 2990.2538 3028.2206 3033.9148 3048.9151 3067.4335 3070.2019 3079.3306 3083.8544 3094.0584 3099.3484 3360.7123 3566.8103
redmass: 3.7753 3.0544 2.0416 2.0920 2.0626 1.0548 1.1848 2.2497 1.5847 1.5673 2.0175 2.6947 2.2630 2.8984 2.9858 2.2130 2.8558 2.4348 2.4961 1.0927 3.2943 1.3852 1.2295 2.7364 2.2857 1.9465 1.6083 1.6970 1.7199 1.5614 1.8941 2.3337 2.3459 1.7399 2.1999 1.8426 1.6104 2.2850 1.3872 1.2883 1.2595 1.2933 1.4451 1.3428 1.3286 1.3688 1.7324 1.2228 1.2203 1.2003 1.1665 1.3308 1.0816 1.0592 1.0487 1.0585 1.0589 1.0472 1.0688 1.0585 1.0823 1.0658 1.0579 1.0376 1.0395 1.0381 1.0574 1.0997 1.0943 1.1004 1.0992 1.0975 1.0987 1.1002 1.0992 1.0993 1.0662 1.0660
irintensity: 1.9115 0.5635 0.8058 0.2936 2.6156 1.0181 0.8463 2.4760 0.6940 47.4945 37.1040 8.5918 19.4104 11.0974 2.2883 9.8099 4.6925 3.9777 7.0925 131.2834 15.3656 1.7703 9.5035 29.1544 1.2182 1.7722 19.7280 17.9958 11.5552 11.5715 17.4858 7.9798 1.1330 28.0549 32.2711 75.0591 6.8628 16.4756 2.4388 10.1456 3.4853 5.5260 44.8536 11.2453 7.5773 6.8348 8.0535 5.9292 30.0076 23.3659 17.0452 85.1653 6.6659 6.1837 10.7111 7.7885 20.9714 7.4988 15.7418 10.8382 71.1209 38.2061 39.4725 30.9732 29.6827 18.4009 33.7008 15.3322 14.2423 34.0235 76.3736 26.8933 46.5981 48.0616 25.3266 27.8292 201.5728 5.2100
temp: 298.150 k
press: 1.00000 atm
elementType: 8 8 6 6 6 6 6 6 6 6 1 1 1 1 1 1 1 1 1 1 1 1 1 1 1 1 1 1
symmnumber: 1
zpe: 653467.9 jmol-1
zpe.correction: 0.248893 hartree
zpe.thermalcorrener: 0.261961 hartree
zpe.thermalcorrenthalpy: 0.262905 hartree
zpe.thermalcorrgfe: 0.210229 hartree
zpe.sumelectzpe: -465.236411 hartree
zpe.sumelectthermal: -465.223342 hartree
zpe.sumelectthermalent: -465.222398 hartree
zpe.sumelectthermalfe: -465.275075 hartree
dipole: 4.0497 1.7195 0.4605
dipole: 4.4236
quadrupole: -63.7656 -65.8641 -62.9041
quadrupole: -4.9085 -4.6120 0.2397
quadrupole: 0.4124 -1.6862 1.2738 -4.9085 -4.6120 0.2397
hfenergy: -465.4853034 hartree
pointgroup: C01 [X(C8H18O2)]
dipole: 1.6020422 0.6563019 0.1780084 debye
polarizability: 108.8358798|-1.5044126|90.5832024|-0.4003642|1.3281922|84.101355 unknown
InChI: InChI=1S/C8H18O2/c1-4-7(9)6-8(3,10)5-2/h7,9-10H,4-6H2,1-3H3
charge 0 multiplicity 1
28 atoms
O  1.103119 -1.680043 -0.592794
O  -1.558522 -1.253763 -0.673191
C  1.34549 -0.398856 0.161165
C  0.007562 -0.129591 0.896871
C  -1.242878 0.016763 -0.003755
C  1.723447 0.69001 -0.881865
C  2.481904 -0.650269 1.172909
C  -2.487054 0.423528 0.808627
C  1.907367 2.115296 -0.314889
C  -3.73541 0.595673 -0.080143
H  0.129254 0.784795 1.508902
H  -0.170109 -0.97006 1.596425
H  -1.056784 0.803564 -0.77312
H  2.66846 0.375603 -1.374856
H  0.948423 0.701843 -1.670963
H  2.637486 0.223428 1.830766
H  2.233087 -1.519053 1.806419
H  3.438156 -0.858715 0.655313
H  -2.673094 -0.362119 1.567299
H  -2.270549 1.365894 1.352816
H  2.199728 2.813969 -1.119317
H  2.694721 2.151686 0.459388
H  0.971451 2.496987 0.130957
H  1.895027 -1.891014 -1.148135
H  -3.913401 -0.328979 -0.654194
H  -4.633322 0.81694 0.525649
H  -3.600001 1.423744 -0.802292
H  -0.680759 -1.691864 -0.875392
