program: Gaussian 09
title: 000251262
version: EM64L-G09RevD.01
frameworkgroup: C1[X(C8H16O4)]
method: RPBEPBE
basis: SDD
operation: Freq
keyword: #pfreq=noraman
keyword: PBEPBE/SDD
title: #p freq=noraman PBEPBE/SDD
converged: YES YES NO NO
title: Mulliken charges:
elementType: O O O O C C C C C C C C H H H H H H H H H H H H H H H H
charge: -0.275743 -0.302403 -0.239527 -0.444986 -0.181067 -0.278588 -0.256555 0.265275 -0.686605 -0.683566 -0.244720 -0.319612 0.236504 0.237674 0.241177 0.206747 0.204708 0.216125 0.238122 0.221214 0.221994 0.224974 0.232450 0.191971 0.209494 0.210204 0.203977 0.350764
chargesum: 0.00000
title: Mulliken charges with hydrogens summed into heavy atoms:
elementType: O O O O C C C C C C C C
charge: -0.275743 -0.302403 -0.239527 -0.094222 0.055436 0.200262 0.154900 0.265275 -0.011144 -0.004148 0.156745 0.094568
polarizability: 1.35017015e+02 2.51735566e+00 8.89978762e+01 1.02953903e+00 -1.59377562e+00 8.44065800e+01
1716.lowfreq: -13.4332 -0.0007 -0.0007 0.0004 1.0429 3.7411 19.5324 24.9886 31.7313
frequency: 19.4299 21.6523 31.6432 54.5263 70.7156 93.3386 126.6798 158.7876 175.4541 202.6004 218.7963 234.5139 264.3796 281.1347 301.6554 369.1815 391.1414 451.8631 496.0901 529.7507 640.6949 714.5395 801.2497 816.6877 829.8483 870.8626 887.2921 926.4314 955.4889 963.1357 980.8511 1025.2208 1071.8452 1086.8965 1096.4898 1101.6821 1106.5771 1112.8158 1114.2700 1174.0314 1175.6991 1190.5971 1211.0064 1251.4367 1303.0695 1307.8010 1330.2310 1339.9956 1357.5741 1374.5937 1383.3722 1394.6493 1408.7228 1458.5911 1460.8370 1464.6870 1470.5394 1477.9370 1478.7748 1490.1692 1491.6458 1645.4205 2938.4682 2950.9635 2968.9898 2984.6210 2988.4939 3003.2973 3004.9274 3025.9717 3035.2726 3082.7622 3083.6106 3086.9009 3090.2925 3097.6155 3098.8262 3545.0773
redmass: 4.4684 2.8571 5.1533 4.2256 3.1007 2.5602 4.3421 3.1998 2.8520 1.0356 3.1778 1.3851 3.3939 2.5765 2.7619 2.6425 3.5786 1.1916 3.2182 2.9155 3.2177 6.4081 3.5691 1.1242 2.8505 2.6445 3.2309 1.1681 3.7872 1.4412 2.6058 3.6627 4.0595 2.0364 1.8908 2.8414 2.2170 2.7465 1.6872 1.1569 1.7870 1.2023 1.2244 1.1384 1.3094 1.2420 1.2052 1.5449 1.4151 1.1985 1.2576 1.2100 1.5323 1.0907 1.0885 1.0450 1.0486 1.0638 1.0617 1.0603 1.0814 9.5347 1.0553 1.0553 1.0716 1.0342 1.0351 1.1035 1.1064 1.0571 1.0853 1.0965 1.1008 1.1000 1.1011 1.1091 1.0997 1.0653
irintensity: 0.6108 1.0099 1.0927 0.2378 0.9743 0.4383 5.7403 7.1706 4.7727 0.2347 1.7575 3.0198 9.1273 1.1734 11.1564 6.2290 18.5017 169.9967 10.3455 2.7698 1.3982 4.1972 26.8839 0.6695 3.4144 17.1152 9.9008 5.0917 7.1346 1.0897 23.3046 121.1382 166.1420 31.0690 116.9866 220.4423 10.4767 79.4968 1.0212 3.4760 5.3815 7.6599 25.3011 0.0625 7.5456 10.0519 10.7569 12.6178 21.8206 14.3937 26.8470 27.7971 5.3442 14.9683 2.0961 7.1274 1.8203 15.6082 4.4195 22.2905 10.0116 161.8275 41.1550 67.6152 28.4586 27.4601 26.2789 127.3583 2.4506 15.1682 6.4590 36.4303 18.4411 43.2486 8.9194 27.6161 45.7780 8.0324
temp: 298.150 k
press: 1.00000 atm
elementType: 8 8 8 8 6 6 6 6 6 6 6 6 1 1 1 1 1 1 1 1 1 1 1 1 1 1 1 1
symmnumber: 1
zpe: 617414.7 jmol-1
zpe.correction: 0.235161 hartree
zpe.thermalcorrener: 0.250399 hartree
zpe.thermalcorrenthalpy: 0.251344 hartree
zpe.thermalcorrgfe: 0.189485 hartree
zpe.sumelectzpe: -614.327464 hartree
zpe.sumelectthermal: -614.312226 hartree
zpe.sumelectthermalent: -614.311282 hartree
zpe.sumelectthermalfe: -614.373140 hartree
dipole: 1.4327 -3.6725 0.6127
dipole: 3.9894
quadrupole: -78.5838 -75.4037 -73.9870
quadrupole: 6.5093 7.5775 1.8865
quadrupole: -2.5923 0.5878 2.0045 6.5093 7.5775 1.8865
hfenergy: -614.5626252 hartree
pointgroup: C01 [X(C8H16O4)]
dipole: 0.4378873 0.2046285 -1.4932952 debye
polarizability: 133.9785757|7.6877843|85.0546172|-0.8389578|0.2633319|89.3882787 unknown
InChI: InChI=1S/C8H16O4/c1-7(2)8(10)12-6-5-11-4-3-9/h7,9H,3-6H2,1-2H3
charge 0 multiplicity 1
28 atoms
O  0.928892 0.382049 -0.470539
O  -2.66973 -0.028535 0.13985
O  2.089474 1.050881 1.434459
O  -4.758256 -1.522837 1.356332
C  3.324765 0.635431 -0.675278
C  -0.327015 0.392638 0.329413
C  -1.426383 -0.042569 -0.635856
C  2.097305 0.732281 0.224425
C  4.206714 1.895465 -0.506694
C  4.111424 -0.654443 -0.309634
C  -3.847879 -0.419451 -0.655188
C  -5.007284 -0.499975 0.337865
H  2.971816 0.555569 -1.718912
H  -0.229838 -0.302594 1.181347
H  -0.507853 1.407903 0.722446
H  -1.220387 -1.059929 -1.030761
H  -1.491457 0.661755 -1.49183
H  5.121574 1.80043 -1.118561
H  4.500405 2.018289 0.550394
H  3.673775 2.810115 -0.822759
H  4.998145 -0.746981 -0.961824
H  3.490975 -1.55903 -0.440288
H  4.453167 -0.612543 0.73992
H  -4.045613 0.333388 -1.449129
H  -3.670761 -1.410084 -1.125991
H  -5.933557 -0.804436 -0.177407
H  -5.162772 0.496323 0.80252
H  -3.856047 -1.340509 1.727784
