program: Gaussian 09
title: 000251260
version: EM64L-G09RevD.01
frameworkgroup: C1[X(C8H16O2)]
method: RPBEPBE
basis: SDD
operation: Freq
keyword: #pfreq=noraman
keyword: PBEPBE/SDD
title: #p freq=noraman PBEPBE/SDD
converged: YES YES NO NO
title: Mulliken charges:
elementType: O O C C C C C C C C H H H H H H H H H H H H H H H H
charge: -0.320912 -0.440736 0.174989 0.325556 0.241849 -0.800642 -0.792192 -0.750270 -0.735024 -0.717566 0.246007 0.235182 0.250848 0.265035 0.221340 0.229757 0.232877 0.212015 0.217212 0.246017 0.224827 0.207630 0.203336 0.208144 0.250687 0.364034
chargesum: 0.00000
title: Mulliken charges with hydrogens summed into heavy atoms:
elementType: O O C C C C C C C C
charge: -0.320912 -0.076703 0.174989 0.325556 0.241849 -0.068604 -0.076060 -0.088167 -0.056550 -0.055399
polarizability: 1.04297355e+02 2.27382642e+00 9.03356838e+01 1.87871404e+00 8.94541627e-01 8.11347011e+01
1716.lowfreq: -114.1908 -5.6878 -0.0009 -0.0009 -0.0008 9.2522 19.9770 54.5834 122.2399
frequency: -114.1479 54.5174 122.2147 173.2349 178.0504 225.4400 239.5605 252.8314 277.6079 289.8693 306.0482 330.0776 341.3288 378.9744 387.4792 397.8506 455.6432 475.5488 513.9647 553.7199 595.1665 652.6701 810.5297 852.4993 894.7742 929.0003 937.6896 951.4220 956.7518 976.1020 1000.6316 1025.6566 1034.4385 1077.8814 1112.3746 1212.5793 1216.6396 1233.7954 1248.7566 1287.3019 1370.3757 1375.6770 1382.3136 1384.7761 1396.3707 1410.9123 1454.2346 1463.6764 1468.3237 1469.6960 1472.2273 1475.5224 1483.1790 1486.1386 1496.9085 1513.3734 2977.2617 2981.4924 2984.3646 2985.7734 2987.8241 3062.7392 3066.3368 3071.7605 3077.7317 3079.7972 3090.6158 3092.9567 3099.9500 3105.6802 3148.7217 3567.6514
redmass: 1.0447 3.1660 2.4858 1.4706 1.0837 1.1214 1.9182 2.1603 1.7179 2.9908 2.0146 2.0798 1.5689 2.0414 2.0978 2.1470 3.6536 3.2879 3.0476 3.8017 3.9899 4.6214 3.0396 5.2369 2.5597 1.7099 1.6490 1.2143 1.4084 1.5264 1.6302 1.4227 1.5417 2.0167 1.8724 2.4531 2.5177 3.6355 2.2793 2.9097 1.1943 1.2026 1.2234 2.0728 1.2599 1.4533 1.0543 1.0836 1.0605 1.0616 1.0495 1.0537 1.0701 1.0538 1.0767 1.0654 1.0360 1.0354 1.0375 1.0363 1.0391 1.0984 1.0997 1.0997 1.0984 1.0991 1.1007 1.0994 1.0993 1.0987 1.0941 1.0650
irintensity: 3.1046 0.4881 1.3612 1.2362 0.0624 2.0863 2.7979 1.2691 47.1675 5.7584 51.0141 7.2354 3.5843 8.2480 3.6827 1.3633 5.5500 27.7213 3.9677 15.1778 5.7354 6.8982 2.4242 28.4348 18.4590 1.8774 0.6605 1.4815 7.7352 55.9158 61.7962 10.4653 30.9906 85.2427 24.9137 13.8927 20.0285 6.6609 13.5080 5.1869 22.5543 12.3887 35.5468 18.8659 18.1651 12.3770 1.4834 1.8430 15.2814 8.7887 0.1408 14.8650 7.6700 14.4362 24.1310 17.6084 28.7454 28.2434 11.9047 35.9803 24.0841 26.5737 11.3383 13.9162 84.5235 10.3706 26.3432 17.7919 12.1463 30.8269 9.7929 13.2348
temp: 298.150 k
press: 1.00000 atm
elementType: 8 8 6 6 6 6 6 6 6 6 1 1 1 1 1 1 1 1 1 1 1 1 1 1 1 1
symmnumber: 1
zpe: 588831.8 jmol-1
zpe.correction: 0.224274 hartree
zpe.thermalcorrener: 0.236287 hartree
zpe.thermalcorrenthalpy: 0.237232 hartree
zpe.thermalcorrgfe: 0.188037 hartree
zpe.sumelectzpe: -464.028299 hartree
zpe.sumelectthermal: -464.016285 hartree
zpe.sumelectthermalent: -464.015341 hartree
zpe.sumelectthermalfe: -464.064536 hartree
dipole: 1.1153 0.7335 1.2373
dipole: 1.8201
quadrupole: -58.1107 -61.0837 -67.2836
quadrupole: -2.1280 1.9383 2.1114
quadrupole: 4.0487 1.0756 -5.1243 -2.1280 1.9383 2.1114
hfenergy: -464.2525729 hartree
pointgroup: C01 [X(C8H16O2)]
dipole: 0.4556137 -0.4293992 -0.3475753 debye
dipolederiv: -0.6292239 0.0592524 -0.0976741 0.0297904 -0.5429263 -0.1373499 0.0254258 -0.0196543 -0.7200302 -0.5022202 0.0235842 0.1537287 0.1619514 -0.8541683 0.2954068 0.0772576 0.2675413 -0.4916629 0.7443398 -0.02498 0.0607129 -0.0063982 0.7421866 -0.1728182 0.2066999 -0.2941387 0.5049957 0.2615799 0.0683356 -0.0575382 -0.0890221 0.3565511 -0.0105279 -0.2404202 0.0269405 0.2364484 0.0866327 -0.0468063 -0.0095932 0.0823205 0.0782993 0.0056957 -0.0052174 -0.0026512 0.1012448 -0.1320745 -0.0993865 0.0781135 -0.0625847 -0.0815795 0.0542606 0.0172377 0.0535394 -0.0187063 -0.0306053 0.0423379 0.0445303 -0.000056 -0.1385656 0.0401842 0.0478027 0.077259 0.0311546 -0.0032275 -0.0291713 -0.0001939 -0.0144237 -0.0363802 0.0529307 -0.0093357 0.0446335 -0.0082147 -0.0469641 0.0572124 0.0230264 0.0005034 -0.0369214 -0.0219543 0.0199948 -0.025967 0.0034793 0.009384 -0.0030536 -0.0289223 -0.0247685 0.0268819 -0.0074463 0.0040024 0.0117924 -0.0662389 0.0563807 -0.0290772 -0.0030412 -0.0853775 -0.0153967 -0.0623041 -0.0449013 -0.0900831 0.0169184 -0.0548573 0.0891356 0.0410543 0.1393175 -0.001151 -0.0335393 0.0400343 -0.0155969 0.0969015 0.1000025 0.0264556 -0.0734829 -0.0184319 0.0444487 0.0851622 -0.0047563 0.0722278 -0.0476147 0.0630354 -0.0822118 0.1009409 -0.0619322 0.0351013 0.0305429 0.0950855 0.0592894 0.0244496 0.1040899 0.0037066 -0.0101292 0.0364135 -0.0006745 -0.0724365 0.0093827 -0.10914 -0.0637712 -0.1409734 0.0520043 -0.1025279 0.0067762 0.0537497 -0.0096613 -0.1031674 0.0313429 0.0588192 0.0915871 0.0225325 -0.0916759 0.0015408 0.0699312 -0.0272728 -0.0856928 0.0138827 -0.1089982 -0.1833589 -0.095739 0.0288796 -0.0389222 0.0671731 0.0130231 -0.009375 0.0083652 0.0943281 0.0412391 0.1252435 0.04798 0.1083269 -0.0815723 -0.0474452 0.0760328 -0.0821359 0.0231247 0.1282531 0.0030533 0.0059592 0.0336982 -0.0841741 0.068924 -0.0221857 0.1049896 0.0410885 0.0921621 -0.0055084 -0.0662829 0.0063724 0.0752784 -0.034754 -0.0245689 -0.0624726 -0.1368893 -0.1735818 -0.0618043 0.006823 -0.1126821 0.0397881 -0.0082111 -0.0052555 -0.0177493 0.0921187 -0.0140226 0.1250617 0.0853504 0.111789 -0.0320349 -0.0941749 0.0521998 -0.0587898 0.0167612 -0.1570393 -0.1016634 -0.0464851 -0.1060786 0.0533611 -0.0272218 -0.0032157 -0.0010602 0.0685103 0.1192301 0.00344 0.008946 0.023048 -0.0439075 0.1253715 0.0078162 0.0826836 0.015606 0.1702323 -0.1219537 -0.0984985 -0.1211706 0.3067019 -0.0043842 -0.1208802 -0.0750482 0.2361774 unknown
polarizability: 104.402779|-2.5205948|89.8044011|-0.2418262|-2.3015714|81.5605595 unknown
InChI: InChI=1S/C8H16O2/c1-6(2,3)8(9)7(4,5)10-8/h9H,1-5H3
charge 0 multiplicity 1
26 atoms
O  0.762585 0.58516 1.160659
O  0.009493 1.644351 -0.907658
C  0.059748 0.416304 -0.146037
C  1.4385 -0.211092 0.005859
C  -1.346996 -0.224136 -0.189427
C  2.608976 0.520056 -0.662572
C  1.7334 -1.662738 0.348103
C  -1.459929 -1.541127 0.617392
C  -2.344882 0.801804 0.422422
C  -1.708974 -0.4959 -1.676335
H  3.001275 1.304899 0.009817
H  3.43436 -0.179277 -0.877445
H  2.299176 0.994385 -1.610659
H  0.988513 -2.093967 1.027931
H  1.776092 -2.277468 -0.570898
H  2.721653 -1.727377 0.840409
H  -1.085187 -1.414414 1.648629
H  -2.525906 -1.82872 0.674929
H  -0.92157 -2.376079 0.136839
H  -2.323255 1.753183 -0.132978
H  -2.09441 1.007069 1.47948
H  -3.370959 0.391582 0.383346
H  -1.006459 -1.218032 -2.133947
H  -2.726739 -0.923396 -1.739887
H  -1.679654 0.435967 -2.264657
H  0.675249 2.267963 -0.520514
