program: Gaussian 09
title: 000251274
version: EM64L-G09RevD.01
frameworkgroup: C1[X(C10H19BrO4)]
method: RPBEPBE
basis: SDD
operation: Freq
keyword: #p
keyword: freq=noraman
keyword: PBEPBE/SDD
title: #p freq=noraman PBEPBE/SDD
converged: YES YES NO NO
title: Mulliken charges:
elementType: Br O O O O C C C C C C C C C C H H H H H H H H H H H H H H H H H H H
charge: 0.022837 -0.272807 -0.268878 -0.240297 -0.230767 -0.367987 -0.264762 -0.346053 -0.295780 -0.303530 -0.685477 -0.280449 -0.298000 0.355547 -0.766953 0.205684 0.206832 0.190614 0.181830 0.194138 0.191441 0.230076 0.207108 0.240364 0.194584 0.212130 0.215590 0.211356 0.219412 0.237236 0.245076 0.248043 0.305935 0.305903
chargesum: 0.00000
title: Mulliken charges with hydrogens summed into heavy atoms:
elementType: Br O O O O C C C C C C C C C C
charge: 0.022837 -0.272807 -0.268878 -0.240297 -0.230767 0.044530 0.107683 0.039526 0.141404 0.131419 -0.046400 0.176198 0.195120 0.355547 -0.155115
polarizability: 1.56287849e+02 -7.32137555e-01 1.37772577e+02 5.25870999e+00 6.07469902e+00 1.18645937e+02
1716.lowfreq: -13.5342 -12.3793 -5.2193 -0.0005 -0.0004 0.0001 4.8865 9.3083 19.7955
frequency: -11.0474 7.8413 19.4471 31.6303 34.7231 44.0822 71.0578 87.3837 100.3963 101.7844 109.5497 153.8899 163.4850 230.1406 233.1990 266.7667 272.6095 304.4218 325.8069 336.1805 386.6566 432.4101 452.9954 521.5596 536.4921 643.4294 722.9135 740.0719 767.3006 799.3691 805.2262 811.3552 867.9734 874.7067 897.9840 908.2442 930.6411 948.4409 1019.0241 1023.2128 1037.3449 1052.7175 1059.2091 1077.7174 1084.1590 1110.3216 1123.3612 1140.3854 1157.0664 1206.5032 1212.9700 1220.2822 1234.7200 1244.8644 1268.7755 1271.7078 1279.7698 1283.1307 1289.4893 1319.6282 1324.0791 1345.4842 1371.8113 1377.8096 1386.2392 1392.6533 1426.5182 1454.2832 1460.4172 1469.1972 1471.8399 1473.7611 1476.5561 1477.9442 1484.6439 1492.0986 1629.9028 2919.5672 2950.2771 2962.4602 2965.8226 2973.1350 2974.7963 2985.6941 2991.7597 3009.2625 3050.2391 3055.0131 3061.2609 3062.5897 3073.2032 3074.4388 3087.0175 3091.4023 3139.2055 3184.0115
redmass: 2.1277 3.4059 4.7573 8.6616 5.0858 4.1480 3.3792 3.6761 2.5760 2.2518 3.2521 3.2435 5.5604 1.3236 2.6655 4.1713 2.7102 4.1446 4.1145 3.0180 3.1689 3.1226 4.0324 7.7369 3.9078 4.9768 6.5044 1.0726 2.1032 1.1520 1.1553 1.7104 4.2546 3.7884 1.8364 1.8551 1.1516 6.9717 5.1054 4.6958 4.1945 3.9156 5.0234 2.2115 1.4848 2.0367 2.1384 1.4661 1.8422 1.3934 1.4146 1.3603 1.5573 1.2381 1.2576 1.1705 1.0900 1.1130 1.1036 1.2150 1.2101 1.4823 1.2683 1.2916 1.3029 1.2535 1.1181 1.0935 1.0784 1.0733 1.0774 1.0755 1.0425 1.0768 1.0714 1.0896 9.5746 1.0548 1.0655 1.0748 1.0593 1.0965 1.0367 1.0597 1.0593 1.1005 1.0609 1.1040 1.0955 1.1019 1.1012 1.0994 1.0556 1.1002 1.1084 1.1127
irintensity: 0.3295 0.3882 1.2093 0.5493 0.5235 0.8288 0.8345 1.6185 0.9666 0.3414 1.0369 1.2965 1.2651 1.1478 4.9572 3.2477 13.7771 12.7429 13.3693 1.3678 6.3145 4.9153 16.1051 21.5556 2.5904 14.2082 0.6238 8.8432 11.1972 2.3658 0.5969 2.2063 7.8183 16.0508 3.0269 3.4392 1.1274 82.2269 20.9948 88.8071 95.5433 35.2394 60.5205 6.1515 101.1911 18.5504 11.1987 1.5198 5.5272 2.0400 64.2816 37.2431 63.8808 20.6980 1.2891 0.2065 0.0827 0.8784 6.3832 5.0018 3.2179 0.2704 9.4802 15.1017 6.1718 4.3133 20.0606 7.9733 0.6796 0.1463 6.7375 10.3772 12.7666 4.7499 9.3426 15.6654 174.8030 36.1995 48.7739 22.9613 34.4484 61.9491 34.6821 28.9392 44.6926 6.4312 20.7002 22.6957 21.0794 24.5253 100.1989 50.5961 5.8126 34.9712 14.3905 0.1343
temp: 298.150 k
press: 1.00000 atm
elementType: 35 8 8 8 8 6 6 6 6 6 6 6 6 6 6 1 1 1 1 1 1 1 1 1 1 1 1 1 1 1 1 1 1 1
symmnumber: 1
zpe: 740398.2 jmol-1
zpe.correction: 0.282003 hartree
zpe.thermalcorrener: 0.300172 hartree
zpe.thermalcorrenthalpy: 0.301116 hartree
zpe.thermalcorrgfe: 0.229375 hartree
zpe.sumelectzpe: -705.541302 hartree
zpe.sumelectthermal: -705.523133 hartree
zpe.sumelectthermalent: -705.522189 hartree
zpe.sumelectthermalfe: -705.593929 hartree
dipole: -1.2870 -0.7235 0.5282
dipole: 1.5681
quadrupole: -102.1474 -106.6426 -98.0452
quadrupole: -6.7139 -9.6431 1.3916
quadrupole: 0.1310 -4.3642 4.2332 -6.7139 -9.6431 1.3916
hfenergy: -705.8233045 hartree
pointgroup: C01 [X(C10H19Br1O4)]
dipole: 0.4445939 -0.1805823 0.3877079 debye
polarizability: 156.3323742|2.8901796|120.3044776|2.1991426|8.9428171|136.0695102 unknown
InChI: InChI=1S/C10H19BrO4/c1-2-3-4-13-5-6-14-7-8-15-10(12)9-11/h2-9H2,1H3
charge 0 multiplicity 1
34 atoms
Br 3.802593 0.89559 2.551238
O  -3.014155 -0.321705 -1.292445
O  0.354726 0.754516 -2.690582
O  2.886185 -0.832454 -0.393016
O  1.123271 -1.10073 1.120368
C  -4.770195 0.135463 0.314157
C  -3.30078 0.392151 -0.033645
C  -5.212257 0.86825 1.602335
C  -1.586202 -0.431548 -1.608048
C  -1.043683 0.873471 -2.235313
C  -6.69305 0.60538 1.95175
C  1.347662 0.698909 -1.61067
C  1.895432 -0.738502 -1.511395
C  2.347642 -0.983422 0.881666
C  3.449096 -0.998449 1.920715
H  -5.398555 0.46048 -0.537868
H  -4.923295 -0.955144 0.426177
H  -2.631085 0.013545 0.771047
H  -3.117473 1.482736 -0.152129
H  -4.57096 0.548373 2.448946
H  -5.049348 1.958944 1.481722
H  -1.508988 -1.25159 -2.343216
H  -1.011394 -0.704895 -0.696302
H  -1.615875 1.111747 -3.146902
H  -1.136368 1.7209 -1.523501
H  -6.876689 -0.473845 2.110044
H  -6.990968 1.138423 2.873185
H  -7.358591 0.942113 1.134816
H  0.908049 1.009009 -0.641911
H  2.16051 1.39803 -1.875537
H  1.081129 -1.460338 -1.333471
H  2.467569 -1.014566 -2.408825
H  4.401837 -1.35724 1.510801
H  3.13261 -1.551301 2.814309
