program: Gaussian 09
title: 000251259
version: EM64L-G09RevD.01
frameworkgroup: C1[X(C7H14O2)]
method: RPBEPBE
basis: SDD
operation: Freq
keyword: #pfreq=noraman
keyword: PBEPBE/SDD
title: #p freq=noraman PBEPBE/SDD
converged: YES YES NO NO
title: Mulliken charges:
elementType: O O C C C C C C C H H H H H H H H H H H H H H
charge: -0.487856 -0.433564 0.286400 -0.438691 -0.527453 -0.387499 -0.376535 -0.390764 -0.371715 0.234692 0.189293 0.212022 0.203176 0.221440 0.195769 0.197263 0.202510 0.187591 0.206804 0.179319 0.210787 0.336434 0.350577
chargesum: 0.00000
title: Mulliken charges with hydrogens summed into heavy atoms:
elementType: O O C C C C C C C
charge: -0.151422 -0.082987 0.286400 -0.014705 -0.112254 0.029711 0.023237 0.003630 0.018391
polarizability: 8.57403650e+01 -4.38922385e-01 7.81469099e+01 3.42681252e-01 4.26152529e-02 7.26825062e+01
1716.lowfreq: -39.5055 -19.1324 -16.7024 0.0003 0.0004 0.0006 103.3167 129.4991 185.5749
frequency: 103.0885 129.4664 185.5012 209.6784 287.2939 297.2324 325.2684 335.7074 402.6306 414.7646 465.8127 493.8174 552.7259 613.0586 703.4648 773.4460 814.1777 843.2283 865.8609 908.5240 922.0036 944.0808 984.3356 997.4386 1049.8835 1068.9130 1083.3800 1100.6262 1117.0610 1144.0666 1164.8020 1175.2983 1248.0846 1259.1028 1270.3225 1281.2278 1316.1234 1336.7329 1341.5987 1344.0710 1353.3846 1371.1660 1385.8940 1450.9558 1457.3953 1458.9766 1465.4926 1467.6167 1474.6976 2914.1401 2953.1914 2962.2133 2979.6496 2981.7343 2991.0123 3010.0957 3031.4184 3041.2567 3051.0085 3057.0818 3063.3686 3473.6723 3543.4535
redmass: 3.4531 3.2725 2.7775 2.5715 2.4765 1.1233 2.5537 2.4994 2.1815 2.3154 2.7091 2.0728 1.1537 2.4937 4.3632 1.4813 2.7007 1.7886 2.0602 2.5387 1.4428 2.0633 2.1381 2.8730 1.9000 1.4900 1.2517 2.1182 1.6288 1.9758 1.3498 1.4492 1.3747 1.3271 1.2725 1.3475 1.2918 1.3820 1.5204 1.5403 1.5556 1.6920 1.2470 1.0864 1.0952 1.0878 1.0881 1.0856 1.0943 1.0704 1.0610 1.0640 1.0639 1.0636 1.0623 1.0972 1.0951 1.1028 1.0995 1.0936 1.0982 1.0643 1.0658
irintensity: 5.9847 8.2183 1.9498 5.1893 5.0190 38.8184 28.8437 0.1012 0.5595 4.0786 6.3348 2.8666 179.7747 51.3412 12.4824 1.3073 14.5516 7.6570 22.4087 17.3165 4.5399 15.6424 35.0076 44.6703 7.9276 12.2399 14.5523 9.7411 11.3880 11.9277 16.3323 25.5995 11.3808 3.0046 4.1915 20.2258 4.3486 1.6368 1.2842 0.6026 17.7103 12.6121 35.9502 7.8126 4.3402 11.2331 5.8696 18.9046 2.4040 74.8021 54.2517 35.7304 40.5787 14.1134 32.9190 36.6364 61.5478 39.3039 41.5761 7.2008 77.9327 14.0285 3.0123
temp: 298.150 k
press: 1.00000 atm
elementType: 8 8 6 6 6 6 6 6 6 1 1 1 1 1 1 1 1 1 1 1 1 1 1
symmnumber: 1
zpe: 531218.4 jmol-1
zpe.correction: 0.202330 hartree
zpe.thermalcorrener: 0.211717 hartree
zpe.thermalcorrenthalpy: 0.212661 hartree
zpe.thermalcorrgfe: 0.168803 hartree
zpe.sumelectzpe: -424.834553 hartree
zpe.sumelectthermal: -424.825166 hartree
zpe.sumelectthermalent: -424.824222 hartree
zpe.sumelectthermalfe: -424.868080 hartree
dipole: 2.2855 -2.2731 0.0283
dipole: 3.2236
quadrupole: -65.5490 -53.9172 -54.2434
quadrupole: 3.7017 -3.0051 -1.6740
quadrupole: -7.6458 3.9861 3.6598 3.7017 -3.0051 -1.6740
hfenergy: -425.0368832 hartree
pointgroup: C01 [X(C7H14O2)]
dipole: -0.9117514 -0.881513 0.0094573 debye
dipolederiv: -0.7067696 -0.0348144 0.0299875 -0.0303488 -0.187491 -0.0183747 0.0256046 -0.0224988 -0.781536 -0.817008 -0.0714885 0.1444256 -0.0156752 -0.5611216 0.098114 0.152248 0.0999132 -0.3046418 0.3222853 -0.0130997 -0.0335398 0.0102524 0.2134831 0.0972561 -0.101174 0.0890013 0.5397916 -0.0238773 0.032012 -0.0035628 0.00071 -0.0176531 -0.0225322 -0.0188032 0.0472566 0.0973238 -0.0770475 -0.056365 0.0073595 -0.0467472 0.0396991 0.0619541 -0.0393392 -0.0251522 0.0575626 0.0630673 -0.0121612 -0.0261231 0.0183263 0.0683753 0.0271779 0.0169269 -0.0124452 0.1064836 0.068618 0.0230679 -0.0211566 -0.0088764 0.0483559 -0.0153802 0.0200433 0.0024465 0.1287477 0.0601044 -0.0056908 0.014694 -0.0158182 0.037166 0.0022636 -0.0188526 0.0072914 0.1658102 0.3451752 0.0975252 -0.138047 0.0582259 0.4503447 -0.0675693 -0.0558393 -0.0988541 0.2474831 -0.0284555 -0.1138342 0.0315723 -0.0913319 -0.0297914 0.0278288 0.0394935 0.0608008 0.0721965 0.0505162 0.028384 0.0057812 0.028254 0.0676329 0.0191056 -0.0271731 -0.0259266 -0.171727 0.0465057 -0.0108427 0.0057914 -0.0132905 0.0856959 -0.0163546 -0.0138241 0.0339198 -0.1639303 -0.0207213 0.1195838 0.0361101 0.0901804 -0.1598697 -0.0434895 0.0372174 -0.0924664 0.0466026 0.0459962 -0.0328743 0.0069592 -0.0368999 0.0856414 -0.0175833 -0.017028 0.0395164 -0.1443449 -0.005444 0.0830035 0.0128235 0.0851785 -0.1946569 -0.0436617 0.0236356 -0.072753 0.0686387 -0.0810338 -0.1208773 0.0324523 -0.1242853 -0.1117513 0.0459996 0.054314 0.0695774 0.0592238 0.0574812 0.0392274 0.0234196 0.0400056 0.0545 -0.0062338 -0.0292948 -0.0529055 -0.1691542 0.0774864 -0.0085645 -0.005279 -0.0093506 0.018787 -0.0019144 0.0704669 -0.0141842 -0.2018462 -0.2084968 0.0432493 -0.0683399 0.0431862 0.0356399 0.0106549 -0.1071984 0.0177612 0.049048 -0.0290669 0.0159509 0.0159117 0.0436898 -0.274899 0.0182082 0.0288106 -0.0524414 0.0414009 0.069958 -0.0177856 0.0227724 -0.0257747 0.0625725 -0.0551713 0.0205713 0.0018667 -0.1467296 0.3462217 0.0180718 -0.0101778 0.0364623 -0.0204821 -0.0675959 -0.0119568 -0.000189 0.2871071 0.4445054 -0.0016777 -0.0838343 -0.0360727 0.2898223 -0.0327019 -0.0488485 0.0004652 0.1164898 unknown
polarizability: 85.7577526|0.3331636|78.1344237|0.1737946|-0.1078905|72.6776048 unknown
InChI: InChI=1S/C7H14O2/c8-6-7(9)4-2-1-3-5-7/h8-9H,1-6H2
charge 0 multiplicity 1
23 atoms
O  0.752706 -0.213593 -1.46662
O  2.963091 0.410645 0.041876
C  0.565987 -0.230074 0.025964
C  0.032132 1.17433 0.378817
C  -0.436476 -1.335873 0.424474
C  -1.383941 1.422275 -0.185877
C  -1.859417 -1.077533 -0.128136
C  -2.371184 0.324802 0.276114
C  1.970543 -0.487679 0.628217
H  0.74697 1.930263 0.006659
H  0.014068 1.263233 1.484286
H  -0.475615 -1.385737 1.532101
H  -0.060155 -2.323514 0.081005
H  -1.332004 1.428485 -1.291178
H  -1.741074 2.420435 0.132623
H  -2.546673 -1.864038 0.23866
H  -1.844842 -1.149462 -1.233859
H  -2.484709 0.371041 1.37984
H  -3.37437 0.501812 -0.157019
H  2.252627 -1.55302 0.45922
H  1.978974 -0.289299 1.714156
H  0.781725 -1.150403 -1.791978
H  2.738238 0.454704 -0.928245
