program: Gaussian 09
title: 000251209
version: EM64L-G09RevD.01
frameworkgroup: C1[X(C12H22O2)]
method: RPBEPBE
basis: SDD
operation: Freq
keyword: #pfreq=noraman
keyword: PBEPBE/SDD
title: #p freq=noraman PBEPBE/SDD
converged: YES YES NO NO
title: Mulliken charges:
elementType: O O C C C C C C C C C C C C H H H H H H H H H H H H H H H H H H H H H H
charge: -0.266622 -0.243336 0.039698 -0.448345 -0.448340 -0.404239 -0.401861 -0.382798 -0.443507 -0.528875 0.235829 -0.268199 -0.362215 -0.679292 0.184791 0.188472 0.210097 0.200377 0.190846 0.196867 0.189394 0.191694 0.196718 0.198425 0.187951 0.205849 0.233606 0.232394 0.256696 0.216794 0.225904 0.211405 0.233077 0.208794 0.224429 0.217523
chargesum: 0.00000
title: Mulliken charges with hydrogens summed into heavy atoms:
elementType: O O C C C C C C C C C C C C
charge: -0.266622 -0.243336 0.224489 -0.049776 -0.057117 -0.017978 -0.013450 0.003578 -0.004051 -0.039784 0.235829 0.174499 0.082267 -0.028545
polarizability: 1.74233849e+02 2.17463696e+00 1.23001951e+02 2.19967357e+00 6.36655035e-02 1.06365533e+02
1716.lowfreq: -16.2413 -5.9068 -0.0006 0.0005 0.0006 11.4536 14.9811 32.3586 44.8007
frequency: -6.7580 30.4288 44.2906 72.9875 80.7583 86.4194 104.7271 167.7321 185.1279 221.6032 223.1379 237.1483 278.8505 307.6110 321.1517 374.7296 425.4863 432.0821 439.8402 498.6646 543.5442 579.6509 665.9973 754.8055 765.5054 782.0713 783.7300 826.6415 843.2640 868.1540 881.1869 891.1153 899.4896 912.3248 955.2481 962.2460 980.7138 1045.4022 1048.3958 1052.9959 1058.2183 1080.7945 1099.3226 1108.9161 1118.1354 1122.3133 1143.3657 1161.5643 1177.6501 1187.8497 1244.4521 1245.8387 1252.5035 1257.6868 1268.4769 1283.5693 1288.8205 1302.5675 1308.5371 1319.1003 1333.5750 1336.8639 1340.0278 1341.1748 1355.3621 1362.2242 1367.3845 1392.9189 1442.5394 1452.6207 1458.9790 1461.0685 1462.7702 1468.0231 1472.0209 1476.9018 1477.3856 1480.3093 1487.8318 1640.1645 2925.8550 2950.8169 2956.3571 2962.5118 2962.8766 2963.9474 2971.1443 2978.1781 2980.0441 2999.9279 3016.0789 3019.0481 3021.0355 3024.5008 3026.4235 3035.2722 3039.8974 3048.2689 3074.6050 3076.4703 3082.2590 3100.9347
redmass: 3.5343 3.4617 4.2069 3.4189 2.2762 2.5738 2.6155 2.6051 3.8910 1.6136 1.2440 2.9839 2.9313 2.8595 2.0077 3.1710 2.0130 2.9156 3.0550 2.9360 2.1200 3.1621 3.4510 1.4556 1.3669 1.4922 1.7248 3.5905 1.9181 1.8505 1.6201 1.4459 1.5926 1.9654 4.0038 2.4595 1.6049 3.0085 2.9525 1.6652 1.1875 1.6213 2.1747 2.2109 2.5088 2.0795 2.3393 1.6934 1.6697 1.5137 1.2974 1.2405 1.2611 1.2654 1.2293 1.2160 1.1063 1.2838 1.3736 1.2529 1.3937 1.4644 1.5008 1.5734 1.4615 1.5335 1.4962 1.2043 1.0859 1.0950 1.0883 1.0895 1.0893 1.0825 1.0881 1.0514 1.0937 1.0424 1.0823 9.0042 1.0812 1.0624 1.0624 1.0617 1.0601 1.0670 1.0654 1.0359 1.0627 1.0602 1.0964 1.0577 1.0992 1.0948 1.1014 1.1002 1.1019 1.1008 1.1020 1.0941 1.0990 1.1083
irintensity: 0.5357 0.1027 0.8981 0.3224 0.7896 0.6265 1.3502 0.6186 0.7217 0.5290 0.2229 1.7158 3.9571 13.7872 5.7633 2.6926 1.7998 0.4789 0.8834 3.5238 1.1534 3.8196 4.7478 10.8625 2.2096 1.6087 2.2773 5.2476 5.5308 1.0865 6.9287 15.1566 5.7626 0.4351 39.8024 40.3608 4.9086 7.0490 14.1774 2.1924 0.6705 31.5427 13.9082 164.5923 1.1852 2.0288 94.9087 4.4752 57.9120 0.7002 13.0502 4.6125 18.6786 0.8467 21.1469 4.7819 2.0296 3.3393 22.3052 13.5375 1.9317 9.1251 1.3930 0.7843 12.5048 1.2930 11.5315 9.6409 15.7412 10.6462 0.7779 3.9009 8.5843 11.6713 24.0074 4.0255 5.6378 12.3167 17.1384 144.7744 11.1667 23.1543 50.0730 29.2813 33.8515 34.0700 6.5022 35.0501 35.7833 9.7684 87.4839 51.0842 51.1412 49.1736 13.7582 10.7423 151.5347 0.4077 28.6735 22.8129 41.3493 43.7917
temp: 298.150 k
press: 1.00000 atm
elementType: 8 8 6 6 6 6 6 6 6 6 6 6 6 6 1 1 1 1 1 1 1 1 1 1 1 1 1 1 1 1 1 1 1 1 1 1
symmnumber: 1
zpe: 839967.1 jmol-1
zpe.correction: 0.319927 hartree
zpe.thermalcorrener: 0.334899 hartree
zpe.thermalcorrenthalpy: 0.335843 hartree
zpe.thermalcorrgfe: 0.276735 hartree
zpe.sumelectzpe: -619.796400 hartree
zpe.sumelectthermal: -619.781428 hartree
zpe.sumelectthermalent: -619.780484 hartree
zpe.sumelectthermalfe: -619.839591 hartree
dipole: -0.2172 -1.5197 0.2616
dipole: 1.5572
quadrupole: -76.9438 -92.9883 -85.3639
quadrupole: 3.7242 0.1945 0.3558
quadrupole: 8.1549 -7.8896 -0.2653 3.7242 0.1945 0.3558
hfenergy: -620.1163264 hartree
pointgroup: C01 [X(C12H22O2)]
dipole: -0.0868937 0.5987652 0.0963751 debye
polarizability: 174.2444201|-1.2268521|121.2089965|-2.7417836|5.1443337|108.1479166 unknown
InChI: InChI=1S/C12H22O2/c1-2-10-14-12(13)9-8-11-6-4-3-5-7-11/h11H,2-10H2,1H3
charge 0 multiplicity 1
36 atoms
O  -2.707171 0.685029 0.644092
O  -2.12558 -1.377205 -0.28281
C  2.109621 -0.079653 -0.310566
C  2.569467 1.084166 0.60751
C  3.166681 -1.215695 -0.299132
C  3.981698 1.596789 0.235675
C  4.578788 -0.708172 -0.675064
C  5.021682 0.451923 0.247827
C  0.716519 -0.634223 0.076404
C  -0.421356 0.405342 -0.037069
C  -1.8015 -0.221317 0.076978
C  -4.126797 0.230433 0.755452
C  -4.903225 0.527537 -0.535259
C  -6.394676 0.152207 -0.388336
H  2.047751 0.313004 -1.351539
H  2.574795 0.724553 1.659103
H  1.847905 1.923023 0.560404
H  2.853476 -2.022935 -0.99095
H  3.199017 -1.662881 0.717551
H  4.288703 2.40174 0.931844
H  3.949794 2.046785 -0.778779
H  4.571804 -0.353485 -1.726935
H  5.307865 -1.540259 -0.623068
H  6.014694 0.832063 -0.062042
H  5.132148 0.070866 1.284624
H  0.753502 -1.024879 1.11403
H  0.466911 -1.495835 -0.572283
H  -0.36892 0.89946 -1.030194
H  -0.336637 1.206161 0.716171
H  -4.522368 0.805254 1.609596
H  -4.136938 -0.851074 0.983252
H  -4.803473 1.602433 -0.777714
H  -4.450859 -0.043638 -1.366787
H  -6.875672 0.722863 0.428354
H  -6.946449 0.368845 -1.320168
H  -6.516799 -0.924723 -0.168274
