program: Gaussian 09
title: 000251206
version: EM64L-G09RevD.01
frameworkgroup: C1[X(C12H18OS)]
method: RPBEPBE
basis: SDD
operation: Freq
keyword: #p
keyword: freq=noraman
keyword: PBEPBE/SDD
title: #p freq=noraman PBEPBE/SDD
converged: YES YES NO NO
title: Mulliken charges:
elementType: S O C C C C C C C C C C C C H H H H H H H H H H H H H H H H H H
charge: 0.333779 -0.221070 -0.131555 -0.419610 -0.349309 -0.399474 -0.351149 0.267725 -0.703349 -0.286131 -0.699200 -0.271613 -0.142997 -0.517096 0.193305 0.226074 0.193589 0.208943 0.176444 0.231655 0.202040 0.202211 0.191465 0.232012 0.219711 0.202628 0.216020 0.213649 0.207569 0.254250 0.250045 0.269439
chargesum: 0.00000
title: Mulliken charges with hydrogens summed into heavy atoms:
elementType: S O C C C C C C C C C C C C
charge: 0.333779 -0.221070 0.061751 0.000053 0.036077 0.034221 0.042527 0.267725 -0.048997 -0.286131 -0.061962 -0.017363 0.107048 -0.247657
polarizability: 1.61985542e+02 -2.81013491e+01 1.42294715e+02 -5.68443260e+00 6.27968477e+00 1.37570010e+02
1716.lowfreq: -7.6983 -4.5979 -0.0029 -0.0024 -0.0023 8.1361 16.4430 35.7495 49.9274
frequency: 15.8284 35.4805 49.8676 62.0153 83.0502 95.4818 120.7637 149.2382 159.6911 181.8816 213.3680 229.5649 243.7717 286.7104 294.9788 331.6354 408.9449 442.3049 452.5486 489.7697 563.4590 621.2290 670.8213 693.7802 720.0115 725.2654 735.1339 779.1530 796.7453 828.9458 844.7055 860.6693 894.0180 914.8269 922.2873 945.3684 989.6179 1032.8104 1047.8788 1060.9078 1075.4804 1089.2533 1090.9788 1097.5229 1114.9094 1139.1488 1196.6754 1210.9277 1235.7875 1239.0786 1261.3099 1272.3240 1284.7449 1292.1793 1320.6031 1329.3088 1340.6011 1351.3451 1360.9306 1388.3777 1392.8773 1453.5262 1454.8916 1463.3547 1466.1881 1475.6788 1477.8662 1478.3022 1481.4222 1486.3295 1526.2007 1558.4055 2953.2734 2966.7435 2972.2347 2973.5957 2974.8416 2983.8396 2995.5911 2999.1074 3022.6245 3038.6181 3047.4174 3068.5879 3071.5342 3072.1352 3076.4796 3173.8690 3191.1187 3231.5251
redmass: 4.9077 4.2001 1.9540 2.5691 3.3693 2.3716 2.5069 3.8668 3.3094 2.5491 2.7005 1.2402 1.4202 3.5692 3.5025 3.2202 3.3741 7.1709 4.3754 3.5428 3.0032 5.1967 3.5059 4.3707 1.7445 1.1809 1.5423 1.3689 2.5223 1.9818 1.3799 2.5386 2.0748 1.5413 1.3890 1.6033 3.7204 1.4748 2.8273 1.7421 2.0025 2.0420 1.1907 2.0921 1.6516 2.6930 2.1867 1.5006 1.2883 1.6991 1.3112 1.2779 1.2167 1.0723 1.4192 1.3896 2.2758 1.5930 1.5755 1.2132 1.2143 5.8488 1.0986 1.0860 1.0873 1.0712 1.0424 1.0473 1.0522 1.0785 5.6537 7.3116 1.0594 1.0592 1.0375 1.0591 1.0371 1.0605 1.0897 1.0887 1.1014 1.1013 1.1020 1.1005 1.0997 1.0995 1.1002 1.0895 1.0975 1.1002
irintensity: 2.2893 0.3196 0.0192 0.2842 0.8188 0.3913 0.4336 1.0297 0.6052 0.5639 0.5961 1.0060 0.5303 5.5060 0.1424 2.5920 0.1184 1.4438 2.6579 6.0874 0.9072 3.1165 0.1796 0.5120 22.1198 87.7425 6.8471 14.7433 39.6716 0.3200 6.6571 5.4313 19.0690 5.2982 0.4456 0.0140 1.9935 0.4818 2.6917 19.6846 20.4573 4.0898 5.1841 2.1439 4.4874 11.5799 15.8535 0.7264 6.3264 86.1042 21.1263 5.4633 3.7116 2.0604 1.7099 3.6865 3.9785 6.9019 4.3373 10.4605 10.6760 78.0134 0.9607 5.1473 12.0617 6.7046 12.8189 13.3936 13.2629 16.4221 16.4857 132.4127 9.9567 28.5929 44.5664 35.4777 37.6574 52.4040 4.2636 22.5761 10.7080 1.9895 36.0159 72.2544 60.9115 57.2144 59.8410 6.3487 3.1475 0.7914
temp: 298.150 k
press: 1.00000 atm
elementType: 16 8 6 6 6 6 6 6 6 6 6 6 6 6 1 1 1 1 1 1 1 1 1 1 1 1 1 1 1 1 1 1
symmnumber: 1
zpe: 707077.9 jmol-1
zpe.correction: 0.269312 hartree
zpe.thermalcorrener: 0.285447 hartree
zpe.thermalcorrenthalpy: 0.286391 hartree
zpe.thermalcorrgfe: 0.223315 hartree
zpe.sumelectzpe: -940.261915 hartree
zpe.sumelectthermal: -940.245781 hartree
zpe.sumelectthermalent: -940.244836 hartree
zpe.sumelectthermalfe: -940.307912 hartree
dipole: 0.4896 -0.7787 -3.7311
dipole: 3.8428
quadrupole: -86.4202 -90.6411 -95.9962
quadrupole: -6.8573 -2.8213 -1.2879
quadrupole: 4.5990 0.3780 -4.9770 -6.8573 -2.8213 -1.2879
hfenergy: -940.5312272 hartree
pointgroup: C01 [X(C12H18O1S1)]
dipole: 0.2720776 0.4153702 1.4280123 debye
polarizability: 162.094386|28.8012617|143.4117114|2.1208856|4.2551294|136.3441695 unknown
InChI: InChI=1S/C12H18OS/c1-3-5-7-10(4-2)12(13)11-8-6-9-14-11/h6,8-10H,3-5,7H2,1-2H3
charge 0 multiplicity 1
32 atoms
S  2.513172 1.074414 -1.414783
O  0.250232 -0.860791 -1.894238
C  -0.57032 -1.281738 0.35981
C  -2.039003 -0.879607 0.035761
C  -2.345592 0.620362 0.242624
C  -0.388573 -2.826962 0.287398
C  -3.824001 0.972145 -0.040281
C  0.37622 -0.612072 -0.65252
C  1.000501 -3.316983 0.748668
C  1.421772 0.307691 -0.178416
C  -4.134937 2.470028 0.166582
C  1.762493 0.731968 1.110022
C  2.865315 1.649653 1.14893
C  3.376673 1.934607 -0.11288
H  -0.329741 -0.946285 1.387503
H  -2.248843 -1.162992 -1.014418
H  -2.712087 -1.483754 0.67785
H  -1.69666 1.230637 -0.418072
H  -2.094583 0.912495 1.284766
H  -0.573247 -3.144021 -0.756954
H  -1.174387 -3.293285 0.914203
H  -4.071948 0.68186 -1.081353
H  -4.476946 0.361867 0.617139
H  1.805519 -2.915987 0.106001
H  1.060806 -4.419858 0.709148
H  1.211684 -3.005502 1.78954
H  -5.196587 2.696587 -0.042654
H  -3.517155 3.098011 -0.502687
H  -3.921688 2.779983 1.207381
H  1.235125 0.393968 2.004624
H  3.264533 2.081605 2.069512
H  4.205253 2.592657 -0.37151
