program: Gaussian 09
title: 000251246
version: EM64L-G09RevD.01
frameworkgroup: C1[X(C16H16Cl2O)]
method: RPBEPBE
basis: SDD
operation: Freq
keyword: #p
keyword: freq=noraman
keyword: PBEPBE/SDD
title: #p freq=noraman PBEPBE/SDD
converged: YES YES NO NO
title: Mulliken charges:
elementType: Cl Cl O C C C C C C C C C C C C C C C C H H H H H H H H H H H H H H H H
charge: -0.069871 -0.069904 -0.296274 -0.125803 -0.124732 0.541263 0.540421 -0.709363 -0.709417 -0.355647 -0.355492 -0.342301 -0.341808 -0.227347 -0.227498 -0.245845 -0.246018 -0.228606 -0.228629 0.235956 0.235697 0.230653 0.229620 0.227151 0.230629 0.229661 0.227259 0.265870 0.265984 0.255390 0.255312 0.232054 0.232043 0.234800 0.234789
chargesum: 0.00000
title: Mulliken charges with hydrogens summed into heavy atoms:
elementType: Cl Cl O C C C C C C C C C C C C C C C C
charge: -0.069871 -0.069904 -0.296274 0.110153 0.110965 0.541263 0.540421 -0.021938 -0.021868 -0.355647 -0.355492 -0.076431 -0.075824 0.028043 0.027814 -0.013791 -0.013975 0.006194 0.006160
polarizability: 1.95471834e+02 4.28568180e+01 1.89239431e+02 1.61114286e-01 -3.33121107e-02 1.70574959e+02
1716.lowfreq: -20.8717 -13.1397 -7.6730 0.0018 0.0020 0.0021 12.9146 16.2164 29.0219
frequency: 12.4705 16.1745 28.4593 50.8413 86.3881 120.7201 129.0645 140.8023 156.1269 177.8972 191.0671 216.0606 218.6520 250.7469 278.1550 291.7738 327.6665 368.3713 386.0025 395.4680 404.5702 443.5515 459.1548 483.9252 514.7593 550.7564 564.0080 588.9997 615.1267 667.7280 672.2312 732.5539 732.9246 757.5187 762.2357 765.1764 767.3069 822.9409 875.6644 876.3474 930.7385 957.6804 958.5970 993.7792 994.0338 997.1162 1006.6863 1011.4925 1012.0506 1035.6642 1039.9688 1067.5385 1079.0678 1087.8254 1111.5786 1120.7025 1145.1867 1168.4213 1169.1128 1202.6277 1206.7625 1255.4167 1258.7076 1290.5848 1313.9908 1318.0828 1328.6032 1377.3060 1380.5685 1384.8948 1386.2358 1423.3786 1425.2452 1451.5481 1451.9131 1462.8443 1463.0131 1470.2163 1471.5027 1572.5778 1574.1810 1604.2797 1604.3739 2982.8915 2988.1438 2994.1944 2994.4024 3097.4565 3097.8055 3100.4582 3100.6420 3132.7479 3132.9324 3145.3992 3145.6002 3159.0274 3159.1238 3173.8782 3173.9588
redmass: 6.9169 10.0440 6.8376 3.7308 3.8710 3.8692 4.5444 4.8469 6.2979 4.3765 3.2838 1.0507 1.1416 3.6016 3.9957 5.4634 3.9872 4.3459 10.3927 10.4176 4.3347 3.7739 3.5362 4.3835 3.9305 3.6407 3.8012 4.3733 4.4214 5.9882 5.6299 4.2756 4.3401 2.9287 1.6870 1.2836 2.0234 2.4741 1.3338 1.3398 2.8218 1.3512 1.3577 1.5112 1.3652 1.7047 2.4759 5.9792 5.9711 2.1253 1.9174 1.8534 1.9999 2.4974 2.0197 1.6553 1.9686 1.0669 1.0663 2.0105 1.9949 1.6590 1.7335 1.2062 1.4190 1.4434 1.4199 5.0103 3.0153 1.2401 1.3790 2.1711 2.1333 2.1462 2.0675 1.0737 1.0910 1.1048 1.1038 6.2935 6.1760 7.1448 7.1278 1.0836 1.0846 1.0348 1.0348 1.1008 1.1008 1.1000 1.0999 1.0856 1.0856 1.0902 1.0902 1.0953 1.0953 1.0996 1.0996
irintensity: 0.0807 0.3393 1.1870 0.6903 0.1881 0.8381 0.8643 1.5302 2.5958 1.3021 0.1208 0.3954 0.2964 0.0474 0.3860 5.5490 0.5626 3.4710 1.1808 21.5083 0.0009 2.1173 17.0016 2.0214 0.2705 3.3783 6.7694 1.0920 13.4558 10.6631 21.4481 0.2104 1.6106 15.5329 65.4836 33.2862 61.1556 0.3728 1.7870 0.3489 46.7898 5.6951 1.2266 1.1722 1.8143 0.4410 60.4834 53.1418 29.6463 49.0550 5.1171 113.9704 7.3412 14.0772 0.7073 6.9732 0.8503 3.1659 0.9541 14.7630 9.0315 37.1941 0.9309 3.3246 0.8807 16.8662 1.9250 5.0113 10.4184 33.2160 10.9223 29.0211 21.5702 1.8259 34.9051 5.6311 29.1974 4.2704 4.0032 13.7861 8.0314 3.0712 0.0800 12.3376 7.1132 19.6219 20.0416 0.6129 65.9953 13.2899 18.9407 1.0109 1.1008 5.5395 5.2212 16.7290 12.4709 27.9886 2.6392
temp: 298.150 k
press: 1.00000 atm
elementType: 17 17 8 6 6 6 6 6 6 6 6 6 6 6 6 6 6 6 6 1 1 1 1 1 1 1 1 1 1 1 1 1 1 1 1
symmnumber: 1
zpe: 718029.4 jmol-1
zpe.correction: 0.273483 hartree
zpe.thermalcorrener: 0.292020 hartree
zpe.thermalcorrenthalpy: 0.292964 hartree
zpe.thermalcorrgfe: 0.223711 hartree
zpe.sumelectzpe: -1613.265891 hartree
zpe.sumelectthermal: -1613.247354 hartree
zpe.sumelectthermalent: -1613.246410 hartree
zpe.sumelectthermalfe: -1613.315663 hartree
dipole: 0.0189 -0.0079 0.7409
dipole: 0.7412
quadrupole: -112.2283 -122.6576 -125.8927
quadrupole: 11.9149 0.0093 -0.0151
quadrupole: 8.0312 -2.3981 -5.6332 11.9149 0.0093 -0.0151
hfenergy: -1613.5393738 hartree
pointgroup: C01 [X(C16H16Cl2O1)]
dipole: -0.0062765 0.2912908 -0.0122243 debye
polarizability: 207.4423138|-1.3537649|170.582875|-40.2120466|0.2195877|177.261035 unknown
InChI: InChI=1S/C16H16Cl2O/c1-11(13-7-3-5-9-15(13)17)19-12(2)14-8-4-6-10-16(14)18/h3-12H,1-2H3
charge 0 multiplicity 1
35 atoms
Cl -1.703895 -1.883272 -2.260059
Cl 1.719823 -1.755079 2.371189
O  0.005268 1.69732 -0.044181
C  -0.717211 0.867858 -1.032318
C  0.724392 0.917585 0.98617
C  -1.967428 0.232991 -0.416139
C  1.973129 0.247971 0.404316
C  -1.076833 1.812992 -2.190994
C  1.085536 1.920686 2.094451
C  -2.520464 -0.980429 -0.88258
C  2.529263 -0.935668 0.938522
C  -2.657669 0.890177 0.636131
C  2.657912 0.842426 -0.687924
C  -3.693168 -1.545102 -0.344923
C  3.699567 -1.530758 0.428944
C  -3.835172 0.350563 1.194783
C  3.832574 0.271054 -1.220208
C  -4.354645 -0.870334 0.705664
C  4.355138 -0.918984 -0.663146
H  -0.045088 0.06773 -1.40295
H  0.049267 0.139633 1.396588
H  -1.702477 2.644645 -1.822885
H  -1.635246 1.26908 -2.972293
H  -0.159174 2.233101 -2.637617
H  1.712864 2.731024 1.683971
H  1.642654 1.417263 2.903292
H  0.168525 2.36536 2.517983
H  -2.237314 1.831533 1.007395
H  2.235415 1.760335 -1.11167
H  -4.078503 -2.490351 -0.738061
H  4.087392 -2.450935 0.875523
H  -4.345439 0.877843 2.007861
H  4.338294 0.749572 -2.065628
H  -5.266253 -1.300257 1.134065
H  5.264565 -1.373477 -1.07027
