program: Gaussian 09
title: 000251242
version: EM64L-G09RevD.01
frameworkgroup: C1[X(C15H28O2)]
method: RPBEPBE
basis: SDD
operation: Freq
keyword: #pfreq=noraman
keyword: PBEPBE/SDD
title: #p freq=noraman PBEPBE/SDD
converged: YES YES NO NO
title: Mulliken charges:
elementType: O O C C C C C C C C C C C C C C C H H H H H H H H H H H H H H H H H H H H H H H H H H H H
charge: -0.294107 -0.250157 0.037818 -0.448242 -0.447886 -0.403829 -0.401789 -0.382953 -0.442963 -0.536619 0.243322 0.063339 -0.442208 -0.051236 -0.739070 -0.709033 -0.698296 0.185188 0.210416 0.188064 0.190515 0.200440 0.189287 0.196396 0.196371 0.191648 0.187663 0.198262 0.233817 0.204887 0.232015 0.254723 0.227564 0.222193 0.206616 0.199849 0.236207 0.248835 0.223370 0.213263 0.212104 0.214128 0.212532 0.212119 0.215435
chargesum: 0.00000
title: Mulliken charges with hydrogens summed into heavy atoms:
elementType: O O C C C C C C C C C C C C C C C
charge: -0.294107 -0.250157 0.223006 -0.049761 -0.056931 -0.018146 -0.013770 0.002972 -0.004259 -0.049880 0.243322 0.290903 -0.013399 0.148613 -0.030658 -0.069538 -0.058210
polarizability: 2.10120484e+02 1.69071568e-01 1.45605044e+02 2.06649561e+00 -3.50820731e+00 1.46344305e+02
1716.lowfreq: -30.9736 -6.9506 -0.0004 0.0005 0.0006 2.3575 10.9228 21.9794 29.0584
frequency: -21.0350 20.5750 28.1594 48.6514 57.5520 68.3268 89.0945 130.1734 134.0249 163.3922 183.5947 192.7448 205.1947 216.1329 229.0634 264.2001 272.5466 301.5125 320.8136 344.8665 371.8923 388.6062 413.2285 427.8528 432.2155 441.2406 469.1632 530.2468 560.4682 585.9110 677.9612 759.3643 778.5531 781.7359 790.5944 807.4818 842.7234 850.0564 865.0876 884.5385 894.8750 908.6616 917.3452 923.7720 960.5000 960.7665 977.7667 977.9415 1006.7667 1037.4863 1043.8033 1052.8444 1055.9191 1082.6354 1099.1381 1102.6730 1113.9942 1117.8475 1140.2799 1150.1420 1165.0495 1178.0445 1186.7615 1194.5110 1243.6057 1246.8405 1251.5175 1257.3939 1269.9296 1277.5047 1282.7412 1306.6425 1316.2092 1320.4003 1324.4624 1332.4772 1336.9618 1337.4332 1340.4866 1344.7178 1360.6023 1364.3309 1365.6642 1380.3207 1387.1841 1398.9437 1442.4336 1459.1008 1459.1566 1463.2610 1464.5728 1466.4336 1468.1493 1468.2960 1471.6101 1477.3078 1477.4488 1479.1837 1487.5167 1491.3141 1630.9582 2925.1085 2951.1999 2956.7661 2962.5489 2963.1542 2964.0367 2964.0796 2968.3486 2969.3801 2973.0835 2978.6492 2986.7751 2992.6065 3016.3108 3021.3520 3024.6600 3026.4437 3026.9851 3035.0260 3039.7473 3046.3218 3060.7643 3067.1993 3068.8360 3071.8227 3073.2783 3092.7440 3098.6694
redmass: 2.9965 3.8417 3.1062 4.8494 3.4662 3.4972 2.3060 2.7914 3.5430 2.8597 3.2808 1.3308 1.8754 1.7787 1.1912 2.7110 1.1387 2.7533 1.9079 2.5356 2.1477 2.9513 2.1088 3.0356 1.9990 3.1226 2.5965 1.8604 2.7935 2.9568 3.8752 2.0177 2.0310 1.6702 2.2242 2.8782 1.9873 1.9822 1.8254 1.9952 1.7556 1.7836 1.2544 2.8835 2.1023 1.5146 1.8904 1.6005 1.7851 1.4360 2.9589 1.4059 1.4132 1.6117 2.2852 1.9104 2.5260 1.7841 2.2021 2.1737 2.0483 1.6710 1.4982 1.9439 1.2952 1.1869 1.2747 1.2256 1.2230 1.4316 1.2295 1.3389 1.2649 1.4685 1.3566 1.4243 1.5320 1.4176 1.5814 1.3956 1.5152 1.4726 1.5548 1.2154 1.2240 1.2156 1.0845 1.0713 1.0837 1.0884 1.0889 1.0463 1.0719 1.0768 1.0861 1.0606 1.0879 1.0487 1.0475 1.0536 9.6201 1.0809 1.0628 1.0627 1.0605 1.0618 1.0739 1.0719 1.0355 1.0658 1.0362 1.0625 1.0654 1.0362 1.0963 1.0989 1.0947 1.1012 1.0845 1.0995 1.1019 1.1006 1.0996 1.0997 1.0986 1.0991 1.0944 1.0991 1.0998
irintensity: 0.1780 0.0830 0.0478 1.1569 0.2809 0.7373 0.7591 1.2750 1.5796 0.4623 2.3926 0.1894 0.3973 0.0836 0.7543 7.4081 0.5988 1.0594 1.4140 3.3465 0.4243 5.1775 0.9231 0.4879 0.3376 1.7554 5.0449 3.8646 4.1824 1.6669 1.5760 3.5611 8.2526 0.3455 0.5838 12.2349 3.8474 2.5226 2.8014 20.8895 0.8123 2.9867 6.9540 31.9162 11.4568 3.8880 4.3430 3.3619 41.9329 2.2333 11.8928 0.4212 2.0106 33.7087 10.4168 188.0487 4.8923 44.5559 100.5534 31.8008 8.5538 54.5022 1.0175 8.0824 21.9850 2.5565 16.2907 3.8037 23.6181 5.6157 6.4855 41.5333 4.3722 4.0288 1.2467 3.3376 1.7040 4.0718 0.9942 0.5495 17.0793 5.0250 2.5229 15.5209 32.8290 14.9711 14.8577 6.7663 1.9966 3.9091 8.9458 1.9961 10.0410 2.9767 30.1819 3.0296 3.5931 10.3212 18.0061 20.8826 142.2947 11.2389 22.7624 48.8850 33.1376 31.8835 42.4049 6.7635 35.9195 4.7310 23.3121 37.9771 32.1992 18.7595 85.3770 60.7476 48.6819 11.7657 15.4297 9.4959 147.0618 23.4847 14.1870 28.5742 102.2079 57.9593 25.5418 25.6699 22.5447
temp: 298.150 k
press: 1.00000 atm
elementType: 8 8 6 6 6 6 6 6 6 6 6 6 6 6 6 6 6 1 1 1 1 1 1 1 1 1 1 1 1 1 1 1 1 1 1 1 1 1 1 1 1 1 1 1 1
symmnumber: 1
zpe: 1057248.1 jmol-1
zpe.correction: 0.402685 hartree
zpe.thermalcorrener: 0.421804 hartree
zpe.thermalcorrenthalpy: 0.422749 hartree
zpe.thermalcorrgfe: 0.353946 hartree
zpe.sumelectzpe: -737.467881 hartree
zpe.sumelectthermal: -737.448761 hartree
zpe.sumelectthermalent: -737.447817 hartree
zpe.sumelectthermalfe: -737.516620 hartree
dipole: -0.5505 1.1272 -1.3691
dipole: 1.8569
quadrupole: -95.4968 -108.3424 -109.7605
quadrupole: -1.9497 1.2508 4.2200
quadrupole: 9.0364 -3.8091 -5.2273 -1.9497 1.2508 4.2200
hfenergy: -737.8705655 hartree
pointgroup: C01 [X(C15H28O2)]
dipole: -0.2342624 0.4876206 -0.4909854 debye
polarizability: 210.1697349|-0.7253495|146.1824686|-0.8198144|-3.5113853|145.7176296 unknown
InChI: InChI=1S/C15H28O2/c1-12(2)11-13(3)17-15(16)10-9-14-7-5-4-6-8-14/h12-14H,4-11H2,1-3H3
charge 0 multiplicity 1
45 atoms
O  -1.655716 -0.033455 -0.740661
O  -0.84746 -1.521401 0.867588
C  3.278905 -0.338295 -0.178582
C  3.548354 1.015098 -0.888666
C  4.343222 -0.582993 0.923892
C  4.992798 1.109787 -1.437266
C  5.787646 -0.493983 0.377627
C  6.03876 0.861081 -0.324989
C  1.8537 -0.428777 0.419842
C  0.724991 -0.329942 -0.630163
C  -0.635814 -0.709374 -0.065212
C  -3.079645 -0.359196 -0.339589
C  -3.906996 0.899527 -0.677514
C  -5.041279 1.245243 0.334492
C  -3.498658 -1.630662 -1.091106
C  -6.078194 0.107677 0.503039
C  -4.479335 1.688882 1.707821
H  3.386985 -1.146934 -0.937486
H  2.827579 1.166042 -1.715976
H  3.376959 1.837431 -0.160869
H  4.208929 0.176503 1.723704
H  4.172444 -1.572152 1.393784
H  5.12837 0.352561 -2.237766
H  5.15676 2.100604 -1.904539
H  6.514402 -0.639961 1.20061
H  5.956684 -1.316931 -0.347938
H  5.974392 1.677509 0.424431
H  7.062413 0.892136 -0.746696
H  1.739985 -1.38734 0.961611
H  1.722964 0.373169 1.175189
H  0.936596 -1.030701 -1.465451
H  0.65072 0.675215 -1.078082
H  -3.057104 -0.552459 0.748956
H  -3.209761 1.757518 -0.722026
H  -4.342093 0.787757 -1.690485
H  -5.574983 2.11668 -0.100432
H  -4.553519 -1.872591 -0.873766
H  -2.877009 -2.489969 -0.78681
H  -3.397013 -1.481008 -2.181037
H  -6.926414 0.445547 1.126918
H  -6.484127 -0.218825 -0.472973
H  -5.634073 -0.774557 1.002012
H  -5.296588 2.006496 2.381826
H  -3.936966 0.867093 2.212205
H  -3.778611 2.537556 1.598634
