program: Gaussian 09
title: 000251235
version: EM64L-G09RevD.01
frameworkgroup: C1[X(C15H20O2)]
method: RPBEPBE
basis: SDD
operation: Freq
keyword: #pfreq=noraman
keyword: PBEPBE/SDD
title: #p freq=noraman PBEPBE/SDD
converged: NO YES NO NO
title: Mulliken charges:
elementType: O O C C C C C C C C C C C C C C C H H H H H H H H H H H H H H H H H H H H
charge: -0.224198 -0.259595 -0.139884 -0.445047 -0.444853 -0.401633 -0.396379 -0.384301 0.044865 0.349953 -0.536115 -0.391715 0.334664 -0.364065 0.184932 -0.796716 -0.535635 0.209782 0.226584 0.205811 0.222314 0.216794 0.200863 0.187865 0.187917 0.202725 0.197921 0.193375 0.239801 0.278727 0.242320 0.215019 0.239870 0.240126 0.225526 0.225532 0.246850
chargesum: 0.00000
title: Mulliken charges with hydrogens summed into heavy atoms:
elementType: O O C C C C C C C C C C C C C C C
charge: -0.224198 -0.259595 0.069898 -0.012652 -0.005746 -0.012904 -0.005736 0.006995 0.044865 0.349953 -0.296314 -0.112988 0.334664 -0.121746 0.184932 -0.101700 0.162273
polarizability: 2.49677030e+02 8.36534719e+00 1.63827323e+02 4.84594696e+00 -5.27744799e+00 1.09298800e+02
1716.lowfreq: -7.9477 -0.0005 0.0006 0.0007 1.6437 4.2672 24.3825 40.0521 70.4739
frequency: 24.2896 39.9968 70.4185 76.5167 112.6571 127.7884 142.1671 168.9684 190.6820 207.9247 231.8299 234.9322 249.9689 284.8017 328.5961 331.5453 350.4915 387.2192 433.3439 442.7239 453.7216 497.3286 507.6290 548.9630 560.9117 615.1324 691.1506 730.6142 746.3180 767.2871 786.6370 794.6831 831.0638 847.5946 877.8449 891.8624 902.0866 906.4901 921.3165 976.9785 981.3329 983.3403 1001.0167 1031.6997 1047.7380 1049.4294 1055.0728 1073.3256 1111.8021 1112.5849 1119.8229 1135.4558 1149.3708 1175.4578 1188.7828 1217.0686 1237.8169 1252.0324 1253.3083 1264.2019 1278.0039 1288.9779 1312.4396 1324.8924 1334.3968 1342.9018 1347.5229 1360.2455 1378.7853 1401.4837 1410.6663 1436.7226 1457.3664 1462.5416 1464.6199 1465.4095 1468.2755 1470.1050 1472.1905 1477.1812 1479.7648 1496.1621 1552.5049 1591.3220 1614.0363 2960.6924 2962.2729 2967.5226 2969.4642 2971.5058 2978.8804 2983.5582 2992.6116 3023.7887 3026.7502 3034.3325 3041.5108 3056.5989 3058.8268 3062.2477 3091.2705 3129.3558 3137.5701 3146.6605 3166.1296
redmass: 4.1882 3.1678 3.4651 4.2227 1.6190 1.8945 2.9677 3.4504 3.0747 2.6700 2.0665 1.1936 3.5268 2.8051 4.2738 2.6954 4.6204 2.6671 3.0705 2.8826 3.6706 3.0949 2.0042 3.7558 3.6224 6.5490 4.1675 4.8723 3.4555 3.4283 1.7486 2.2785 1.4671 2.3049 1.6683 1.5942 3.1402 1.5468 1.9629 2.3600 1.3963 7.8557 1.7042 2.3103 1.8040 1.5431 1.2106 1.4534 1.2620 2.3973 1.8255 2.0578 1.5002 1.3861 1.6477 1.6960 2.4610 1.7205 1.3598 1.4739 1.3127 1.3390 1.4028 1.3960 1.3722 1.4832 1.5071 1.6393 5.3540 1.3762 2.7115 1.2110 1.0454 1.0860 1.0878 1.0870 1.0501 1.1647 1.0838 1.2208 1.0922 2.1486 8.5814 8.2903 6.2261 1.0632 1.0621 1.0325 1.0635 1.0728 1.0688 1.0365 1.0624 1.0973 1.0939 1.1024 1.1036 1.1019 1.1042 1.0969 1.1004 1.1001 1.0903 1.0873 1.0960
irintensity: 2.1329 0.1324 0.4218 0.1132 2.5936 3.6024 5.5132 3.4851 1.7198 1.4077 0.3485 0.6889 3.0438 2.5711 0.0124 0.2559 2.1752 0.4122 0.9693 2.6639 14.7308 3.2815 2.0830 0.8914 1.5630 24.9658 5.5594 5.5357 5.2384 14.6406 1.8828 2.9097 33.5014 4.0919 2.0500 17.6958 12.7056 12.4138 3.2746 33.3420 1.7709 59.7806 4.2388 10.7446 3.3802 5.5802 0.2160 0.4595 0.3603 0.3846 164.2149 26.2012 14.0820 13.3397 24.4611 6.5683 77.9789 175.7446 21.4428 65.7230 16.6730 52.4203 33.6782 37.2505 1.0119 2.2767 17.2461 36.7497 17.1756 12.0861 2.4980 5.6564 11.7211 2.1587 12.4704 5.9901 14.1302 50.6713 17.9003 12.2895 3.7748 24.3404 197.8645 30.6118 105.9503 35.1827 37.6408 73.8017 38.7599 7.3895 24.5343 26.9987 20.5052 77.6751 78.4878 23.7340 49.7983 69.6007 39.3181 19.4557 16.9849 22.7056 14.3187 2.2875 13.5269
temp: 298.150 k
press: 1.00000 atm
elementType: 8 8 6 6 6 6 6 6 6 6 6 6 6 6 6 6 6 1 1 1 1 1 1 1 1 1 1 1 1 1 1 1 1 1 1 1 1
symmnumber: 1
zpe: 826519.1 jmol-1
zpe.correction: 0.314805 hartree
zpe.thermalcorrener: 0.331589 hartree
zpe.thermalcorrenthalpy: 0.332533 hartree
zpe.thermalcorrgfe: 0.269782 hartree
zpe.sumelectzpe: -732.757499 hartree
zpe.sumelectthermal: -732.740714 hartree
zpe.sumelectthermalent: -732.739770 hartree
zpe.sumelectthermalfe: -732.802522 hartree
dipole: 2.9553 2.2247 0.2001
dipole: 3.7045
quadrupole: -80.7531 -107.4005 -103.3367
quadrupole: -10.7720 2.5353 -1.3817
quadrupole: 16.4103 -10.2370 -6.1732 -10.7720 2.5353 -1.3817
hfenergy: -733.0723036 hartree
pointgroup: C01 [X(C15H20O2)]
dipole: 1.1873692 0.7865948 -0.3091818 debye
polarizability: 249.7934373|9.0279383|146.401818|4.4166997|-25.5443813|126.6078972 unknown
InChI: InChI=1S/C15H20O2/c1-11-10-13(8-9-14(11)17-2)15(16)12-6-4-3-5-7-12/h8-10,12H,3-7H2,1-2H3
charge 0 multiplicity 1
37 atoms
O  -1.338205 -2.263116 1.066022
O  4.454541 0.259158 -0.246158
C  -2.153716 -0.463926 -0.359699
C  -3.437756 -1.303691 -0.563737
C  -2.459655 0.802638 0.505279
C  -4.575181 -0.457461 -1.181226
C  -3.597387 1.645436 -0.11801
C  -4.874827 0.799419 -0.330631
C  -1.041861 -1.275695 0.322408
C  0.390995 -0.863439 0.154098
C  0.810916 0.196822 -0.700028
C  1.381251 -1.56473 0.88946
C  2.163664 0.564832 -0.833488
C  2.740403 -1.2233 0.783343
C  3.130121 -0.161861 -0.072887
C  2.60883 1.688434 -1.745877
C  5.501857 -0.432445 0.513647
H  -1.801956 -0.114963 -1.352421
H  -3.75136 -1.712937 0.414904
H  -3.213096 -2.176157 -1.206964
H  -1.546947 1.417094 0.625596
H  -2.760824 0.467576 1.518358
H  -5.488085 -1.075998 -1.281961
H  -4.28914 -0.142306 -2.206935
H  -3.260999 2.052065 -1.094887
H  -3.815139 2.51504 0.532517
H  -5.662155 1.410952 -0.81281
H  -5.270226 0.485008 0.657247
H  0.071841 0.755298 -1.285081
H  1.053674 -2.379677 1.543309
H  3.483639 -1.779253 1.362451
H  1.745405 2.152099 -2.252447
H  3.14814 2.471044 -1.181518
H  3.312569 1.321578 -2.515546
H  5.550324 -1.504883 0.244791
H  5.339829 -0.327823 1.60344
H  6.438813 0.066266 0.226345
