program: Gaussian 09
title: 000251234
version: EM64L-G09RevD.01
frameworkgroup: C1[X(C11H17NO4)]
method: RPBEPBE
basis: SDD
operation: Freq
keyword: #p
keyword: freq=noraman
keyword: PBEPBE/SDD
title: #p freq=noraman PBEPBE/SDD
converged: YES YES NO NO
title: Mulliken charges:
elementType: O O O O N C C C C C C C C C C C H H H H H H H H H H H H H H H H H
charge: -0.249184 -0.262114 -0.232879 -0.259790 -0.015661 -0.076867 -0.242656 -0.556593 -0.723834 0.217882 0.266576 -0.174430 -0.258617 -0.264724 -0.664059 -0.661172 0.261862 0.347129 0.255565 0.271480 0.242064 0.215092 0.232037 0.231871 0.234965 0.226712 0.236260 0.221229 0.233678 0.248574 0.219940 0.248715 0.230949
chargesum: 0.00000
title: Mulliken charges with hydrogens summed into heavy atoms:
elementType: O O O O N C C C C C C C C C C C
charge: -0.249184 -0.262114 -0.232879 -0.259790 -0.015661 0.184995 0.104473 -0.029548 -0.034640 0.217882 0.266576 -0.174430 0.208220 0.198247 0.039421 0.038432
polarizability: 1.63863029e+02 -3.24887096e+00 1.19052703e+02 -2.97508815e-01 9.87969067e-01 1.23973448e+02
1716.lowfreq: -8.8130 -2.8603 -0.0008 0.0004 0.0007 8.5715 18.6150 23.6114 37.6390
frequency: 18.4807 23.4924 37.5924 54.0554 67.6387 73.0452 91.1488 110.9325 122.0771 136.2508 157.8735 183.3929 201.5791 211.4340 235.1880 243.7127 288.9148 307.7799 330.5442 350.0230 378.4936 400.2715 439.4438 475.0407 499.4243 556.2627 561.2644 619.5053 671.8307 726.1046 778.7362 791.7339 804.1996 817.6020 822.0573 879.7596 909.2802 926.7623 954.7092 981.6080 1013.8653 1016.2253 1072.1352 1091.0366 1096.3647 1097.0467 1125.4510 1156.6235 1157.9119 1165.5446 1184.0729 1210.8175 1233.4839 1276.5538 1277.5814 1294.5666 1301.2268 1338.3697 1346.1457 1353.8190 1361.9178 1391.4795 1393.5559 1397.6808 1436.9955 1458.7374 1458.8766 1462.8700 1464.4117 1478.9725 1483.8926 1484.5177 1484.9947 1622.3811 1631.8390 2194.2304 2937.4837 2983.4911 2985.1240 2994.9930 2995.2354 3025.6311 3033.3414 3033.6852 3060.7042 3078.2529 3090.0098 3090.3171 3090.9448 3095.8686 3097.5956 3122.1885 3124.3440
redmass: 4.9306 5.1066 3.3928 3.4626 4.7669 5.2038 4.0951 4.1655 4.2150 3.5305 2.4825 2.8768 2.1244 1.2599 1.2712 1.5658 2.8934 2.6796 4.1562 5.0791 4.1653 2.9924 3.6194 5.6203 3.9328 3.3996 5.5277 3.7902 4.4444 3.9316 2.9214 2.3384 2.2461 1.4963 2.1827 2.5732 2.0867 2.7291 2.2155 1.9428 2.8292 2.9747 1.9396 2.2980 2.1742 2.2267 2.5639 1.6999 1.6671 3.0506 5.0066 1.2896 1.3716 1.1240 1.1190 1.3633 1.3260 1.4343 1.3952 1.2872 1.5297 1.2288 1.2301 1.2078 1.0865 1.0950 1.0932 1.0448 1.0456 1.0534 1.0516 1.0515 1.0426 8.1732 10.1562 12.5529 1.0790 1.0416 1.0608 1.0362 1.0360 1.0837 1.0596 1.0601 1.0945 1.0992 1.0994 1.0974 1.0976 1.1031 1.1025 1.1065 1.1066
irintensity: 3.1004 0.9004 0.2124 0.2581 0.8413 1.4491 0.4471 0.8445 4.4586 0.5034 6.1726 5.1934 3.8398 3.6731 0.0299 1.1096 10.0421 11.8201 26.3056 4.9553 3.7604 8.6762 1.7306 3.0645 0.9064 9.3964 7.8559 4.0750 7.3961 7.4328 6.6297 3.4337 6.2785 8.6172 1.0876 3.0532 4.9158 23.5707 28.8006 11.2452 166.7807 38.0700 5.0104 114.6491 7.2768 19.3188 195.2540 0.1452 4.4485 350.0926 162.5935 28.8567 16.0573 8.0834 2.8764 24.0716 7.7927 21.9139 16.6914 1.6131 30.4758 23.3082 20.8448 16.0261 33.7476 15.8476 12.9292 14.1965 14.1054 10.3808 11.7472 13.6161 13.4433 159.2195 176.7152 11.2904 91.6786 18.5352 8.1462 16.2126 16.5332 2.6221 32.7265 22.6930 3.3787 31.3037 29.8887 31.0951 29.1891 1.1066 2.1631 31.7039 26.0852
temp: 298.150 k
press: 1.00000 atm
elementType: 8 8 8 8 7 6 6 6 6 6 6 6 6 6 6 6 1 1 1 1 1 1 1 1 1 1 1 1 1 1 1 1 1
symmnumber: 1
zpe: 700381.5 jmol-1
zpe.correction: 0.266761 hartree
zpe.thermalcorrener: 0.285622 hartree
zpe.thermalcorrenthalpy: 0.286567 hartree
zpe.thermalcorrgfe: 0.216873 hartree
zpe.sumelectzpe: -783.761069 hartree
zpe.sumelectthermal: -783.742208 hartree
zpe.sumelectthermalent: -783.741263 hartree
zpe.sumelectthermalfe: -783.810957 hartree
dipole: -1.0748 -0.6783 -2.0411
dipole: 2.4044
quadrupole: -67.8722 -92.1647 -111.9606
quadrupole: -1.0219 0.6776 -4.7595
quadrupole: 22.7937 -1.4989 -21.2948 -1.0219 0.6776 -4.7595
hfenergy: -784.02783 hartree
pointgroup: C01 [X(C11H17N1O4)]
dipole: 0.4037049 -0.7723062 0.3680342 debye
polarizability: 163.4391379|2.6419498|122.7371546|4.7585399|-2.2004997|120.7128877 unknown
InChI: InChI=1S/C11H17NO4/c1-4-15-10(13)6-8(3)9(7-12)11(14)16-5-2/h8-9H,4-6H2,1-3H3
charge 0 multiplicity 1
33 atoms
O  -3.067735 -0.000297 -0.740457
O  3.611518 -0.320906 0.745705
O  -2.503699 -1.333422 1.088573
O  1.796055 -1.365222 -0.273162
N  -0.70924 2.477569 -1.174125
C  -0.051623 0.194792 1.450228
C  -0.793142 0.121636 0.067888
C  1.444605 0.548146 1.271049
C  -0.725215 1.194924 2.414402
C  -2.199959 -0.481225 0.223835
C  2.253609 -0.481407 0.495943
C  -0.785829 1.416662 -0.633611
C  -4.453381 -0.577244 -0.755775
C  4.551055 -1.216159 -0.007341
C  -4.48872 -1.864217 -1.582664
C  4.887127 -0.614084 -1.37367
H  -0.136004 -0.823385 1.874558
H  -0.217514 -0.604945 -0.548981
H  1.920241 0.681474 2.259028
H  1.548464 1.523569 0.752732
H  -1.780435 0.923623 2.590771
H  -0.212714 1.192873 3.393376
H  -0.69094 2.224953 2.013444
H  -5.05514 0.226762 -1.207224
H  -4.767738 -0.754442 0.287684
H  5.432126 -1.27266 0.651147
H  4.081369 -2.21026 -0.106443
H  -5.531023 -2.224964 -1.660776
H  -4.108179 -1.686368 -2.60295
H  -3.886166 -2.655991 -1.106924
H  5.641258 -1.243675 -1.881255
H  3.991247 -0.568307 -2.015295
H  5.302824 0.402399 -1.265908
