program: Gaussian 09
title: 000251241
version: EM64L-G09RevD.01
frameworkgroup: C1[X(C15H28O2)]
method: RPBEPBE
basis: SDD
operation: Freq
keyword: #pfreq=noraman
keyword: PBEPBE/SDD
title: #p freq=noraman PBEPBE/SDD
converged: YES YES NO NO
title: Mulliken charges:
elementType: O O C C C C C C C C C C C C C C C H H H H H H H H H H H H H H H H H H H H H H H H H H H H
charge: -0.268115 -0.247066 0.040502 -0.449690 -0.448992 -0.403891 -0.401955 -0.382756 -0.439529 -0.535536 0.016381 0.240535 -0.357332 -0.392874 -0.410762 -0.711223 -0.723935 0.184431 0.209618 0.188334 0.190779 0.200522 0.189521 0.196758 0.196671 0.191776 0.187743 0.198543 0.204876 0.231979 0.238204 0.257876 0.204653 0.213871 0.237310 0.193658 0.208107 0.209154 0.210493 0.212025 0.224855 0.216312 0.212669 0.211381 0.254120
chargesum: 0.00000
title: Mulliken charges with hydrogens summed into heavy atoms:
elementType: O O C C C C C C C C C C C C C C C
charge: -0.268115 -0.247066 0.224933 -0.051737 -0.057691 -0.017612 -0.013508 0.003530 -0.002674 -0.039456 0.221034 0.240535 0.093848 0.008891 0.008884 -0.058031 -0.045765
polarizability: 2.10294593e+02 -5.09991100e+00 1.51525814e+02 -1.86019997e+00 1.99725712e+00 1.38485240e+02
1716.lowfreq: -24.3433 -7.4331 -0.0010 -0.0005 0.0008 1.1707 10.2409 22.4808 26.7700
frequency: -10.0084 12.6730 25.6225 49.3348 65.7313 72.9117 83.8612 97.5366 122.9833 157.7101 172.9635 210.9007 213.5460 216.4084 218.8281 235.7062 273.9089 304.9380 307.1031 317.5649 364.6116 423.0023 428.5799 440.5284 460.4818 487.6569 518.3639 536.9692 578.7471 664.3541 741.0591 756.5684 764.0392 780.8844 784.0207 814.2903 834.2903 844.1897 869.0553 888.7618 907.7197 909.9190 930.0034 960.7724 968.0592 979.1259 988.2329 1009.0743 1027.1750 1046.6215 1052.9484 1057.3443 1058.9516 1081.3786 1099.0329 1112.9397 1116.6521 1131.7968 1137.8439 1149.7868 1167.8024 1174.5405 1186.6707 1230.0638 1242.4543 1248.2693 1252.1377 1257.7567 1267.3176 1272.7756 1280.3439 1282.9899 1306.5009 1317.3097 1331.6388 1333.8875 1337.3573 1340.1154 1340.4025 1349.2686 1353.6307 1359.8365 1362.3724 1367.4708 1389.6333 1393.4758 1441.5475 1458.2326 1458.5588 1461.8464 1462.8188 1467.2494 1468.2897 1470.7753 1474.9225 1476.5085 1478.2930 1484.5255 1492.3715 1495.3663 1637.8215 2926.9797 2951.4153 2956.7866 2961.9390 2963.0372 2963.6723 2964.8759 2968.7592 2971.6654 2977.7053 2977.8041 2980.7482 2989.1882 3015.9308 3017.3373 3018.8073 3020.7228 3025.0292 3026.6207 3028.7556 3035.9964 3040.3264 3067.9496 3070.7632 3071.8824 3077.8616 3080.5874 3088.5252
redmass: 3.1900 3.4300 3.4549 6.6372 3.4139 3.4304 2.4761 2.1697 1.8785 2.4273 2.9739 2.2094 1.2200 2.6680 2.0194 2.3908 1.9763 2.2334 2.8347 1.7808 2.9270 2.3070 2.5430 2.9645 2.4599 2.7233 2.1118 1.9470 3.3171 3.6918 1.7217 1.7810 1.3887 1.5207 1.8190 1.3988 4.3943 1.9200 1.9468 1.7174 1.7961 1.7925 3.3705 2.2705 1.9729 1.6150 1.7878 1.3873 1.7291 2.6541 1.7788 1.2065 2.3183 1.6354 2.2928 2.2181 2.4461 1.9406 2.1312 1.9923 2.4801 1.6600 1.5212 1.1989 1.3003 1.2861 1.2774 1.2477 1.2320 1.1154 1.1962 1.2154 1.3701 1.2421 1.4693 1.3853 1.4604 1.5346 1.5117 1.5148 1.3752 1.4521 1.5381 1.4418 1.2189 1.2137 1.0848 1.0889 1.0817 1.0887 1.0893 1.0831 1.0596 1.0866 1.0593 1.0943 1.0605 1.0591 1.0511 1.0635 8.8623 1.0808 1.0619 1.0621 1.0788 1.0615 1.0609 1.0665 1.0600 1.0658 1.0380 1.0363 1.0627 1.0641 1.0963 1.0614 1.0950 1.0996 1.0943 1.1022 1.0994 1.0993 1.1017 1.0989 1.0946 1.0995 1.1005 1.1007 1.1071
irintensity: 0.1042 0.1405 0.0395 1.1480 0.6814 0.7787 0.1210 1.9609 0.7859 0.2604 0.2705 1.4325 0.6318 1.4039 0.8157 1.6330 1.7999 4.7762 6.9081 0.7997 6.2766 2.4655 0.1827 0.8733 3.4597 1.2787 4.5245 0.8488 6.9523 2.8280 3.9323 4.7980 16.2071 1.6192 1.3464 8.3217 8.0763 3.9756 2.7062 14.4213 7.3079 1.1781 44.9480 17.5682 0.1298 4.0306 28.9132 2.1762 16.0548 11.3675 2.4585 0.0429 15.7544 30.9093 1.8076 193.3316 8.7952 22.6725 61.8201 6.9622 1.6854 41.4467 1.5942 5.4020 17.8800 5.0212 13.0803 0.6257 25.8567 1.5436 0.3582 5.7687 23.2994 9.9442 0.0981 0.6450 6.2519 1.9224 0.4169 0.0506 1.0206 14.4992 0.9429 10.1181 14.7648 21.4891 17.8583 2.2099 5.5367 2.9329 9.4647 8.2178 1.2135 29.5573 20.0903 5.3424 23.3765 6.0742 11.6637 4.1628 142.2910 10.9897 22.9376 54.2519 14.6062 31.0728 31.7155 34.1236 35.0366 5.7637 34.3787 25.0125 34.1698 35.6155 91.2305 41.5342 30.8556 38.0672 58.5095 15.8737 35.3967 11.3445 142.9760 50.0035 24.4663 61.1379 29.7425 53.5522 17.0844
temp: 298.150 k
press: 1.00000 atm
elementType: 8 8 6 6 6 6 6 6 6 6 6 6 6 6 6 6 6 1 1 1 1 1 1 1 1 1 1 1 1 1 1 1 1 1 1 1 1 1 1 1 1 1 1 1 1
symmnumber: 1
zpe: 1059190.9 jmol-1
zpe.correction: 0.403425 hartree
zpe.thermalcorrener: 0.422461 hartree
zpe.thermalcorrenthalpy: 0.423406 hartree
zpe.thermalcorrgfe: 0.354091 hartree
zpe.sumelectzpe: -737.464050 hartree
zpe.sumelectthermal: -737.445013 hartree
zpe.sumelectthermalent: -737.444069 hartree
zpe.sumelectthermalfe: -737.513384 hartree
dipole: 0.1987 -1.6888 0.1568
dipole: 1.7076
quadrupole: -96.9875 -113.0777 -105.4315
quadrupole: -2.0987 -0.3147 1.5867
quadrupole: 8.1781 -7.9121 -0.2659 -2.0987 -0.3147 1.5867
hfenergy: -737.8674748 hartree
pointgroup: C01 [X(C15H28O2)]
dipole: -0.0828254 0.3417781 -0.5724443 debye
polarizability: 210.3391442|-0.0270056|139.3547571|5.2022282|-3.7839867|150.6117453 unknown
InChI: InChI=1S/C15H28O2/c1-3-13(4-2)12-17-15(16)11-10-14-8-6-5-7-9-14/h13-14H,3-12H2,1-2H3
charge 0 multiplicity 1
45 atoms
O  -1.733592 -0.698705 -1.077909
O  -1.00952 -1.546395 0.978154
C  3.116901 -0.316263 -0.029873
C  3.333466 0.893942 -0.977312
C  4.09374 -0.229489 1.173274
C  4.808022 1.026159 -1.42872
C  5.568786 -0.101874 0.726005
C  5.766281 1.108408 -0.217166
C  1.656069 -0.434229 0.469777
C  0.627082 -0.663392 -0.658254
C  -3.960671 0.303864 -0.589707
C  -0.753976 -1.020964 -0.130756
C  -3.158951 -1.003683 -0.745037
C  -5.474757 -0.04771 -0.520334
C  -3.460216 1.169373 0.601012
C  -6.398476 1.188775 -0.4712
C  -3.666314 0.557624 2.00603
H  3.364117 -1.241556 -0.599177
H  2.681592 0.809174 -1.86876
H  3.028555 1.820273 -0.444243
H  3.822257 0.654842 1.788775
H  3.966595 -1.118999 1.822036
H  5.079681 0.144371 -2.046077
H  4.928105 1.917453 -2.075211
H  6.227268 -0.009437 1.611757
H  5.872702 -1.028956 0.196513
H  5.564122 2.044577 0.344015
H  6.817537 1.160698 -0.561595
H  1.386446 0.483598 1.031466
H  1.577621 -1.270951 1.189971
H  0.959878 -1.504762 -1.302004
H  0.529869 0.211808 -1.322854
H  -3.798943 0.895338 -1.516547
H  -3.529677 -1.59008 -1.603981
H  -3.184567 -1.620383 0.170883
H  -5.736361 -0.656933 -1.41003
H  -5.671063 -0.689969 0.361521
H  -3.964636 2.153974 0.552754
H  -2.382411 1.376578 0.450339
H  -6.204697 1.862775 -1.326959
H  -6.249777 1.769975 0.456355
H  -7.46157 0.888622 -0.510795
H  -3.292489 1.250113 2.782451
H  -4.734651 0.368326 2.219621
H  -3.112781 -0.391415 2.118894
