program: Gaussian 09
title: 000251233
version: EM64L-G09RevD.01
frameworkgroup: C1[X(C14H30O2)]
method: RPBEPBE
basis: SDD
operation: Freq
keyword: #pfreq=noraman
keyword: PBEPBE/SDD
title: #p freq=noraman PBEPBE/SDD
converged: YES YES NO NO
title: Mulliken charges:
elementType: O O C C C C C C C C C C C C C C H H H H H H H H H H H H H H H H H H H H H H H H H H H H H H
charge: -0.485972 -0.450564 0.024579 -0.494475 -0.122036 -0.431732 -0.096820 -0.429795 -0.426627 -0.369549 -0.004694 -0.715761 -0.356593 -0.726998 -0.722641 -0.698518 0.197240 0.184776 0.232209 0.196951 0.198352 0.195160 0.223223 0.194742 0.216383 0.231918 0.178120 0.197610 0.190749 0.230863 0.212698 0.225673 0.217047 0.194463 0.197164 0.343237 0.224779 0.197848 0.213027 0.211836 0.201450 0.214831 0.349362 0.209047 0.210848 0.216587
chargesum: 0.00000
title: Mulliken charges with hydrogens summed into heavy atoms:
elementType: O O C C C C C C C C C C C C C C
charge: -0.142734 -0.101201 0.221819 -0.077490 0.074915 -0.038221 0.126403 -0.018670 -0.016589 0.018811 0.226170 -0.060343 0.035035 -0.091343 -0.094523 -0.062036
polarizability: 1.85348058e+02 -2.04528391e+00 1.52546615e+02 3.46753171e-01 -1.30884576e+00 1.40296268e+02
1716.lowfreq: -13.4192 -7.7231 -0.0005 -0.0001 0.0007 7.8094 19.4065 26.9987 35.3017
frequency: 15.9052 26.7205 34.6584 43.4557 57.7007 64.9942 89.2581 98.9406 108.0795 127.3273 156.4424 169.4408 197.3380 217.8023 225.7300 234.4289 235.7103 247.6174 266.8744 279.0067 292.9440 304.2192 321.9006 343.1662 372.4848 408.2067 417.8181 464.6281 496.7909 516.5791 544.4720 552.4035 647.1873 729.3744 755.8413 768.4233 793.3255 809.5647 823.6703 851.7081 889.9041 912.6343 915.9169 935.9053 947.4893 950.7471 960.5136 972.8606 978.7519 1005.3881 1023.4047 1033.7459 1048.7880 1054.4904 1080.1777 1091.6703 1102.0150 1125.5556 1137.4201 1145.8965 1153.4427 1167.7560 1180.5530 1197.8570 1213.3658 1216.3475 1244.7523 1259.0806 1269.5095 1275.6350 1280.8366 1289.9567 1294.0894 1308.6939 1315.9092 1327.6823 1341.2700 1341.8651 1348.7810 1352.2362 1355.7802 1358.2087 1373.6361 1374.8757 1385.9877 1387.3301 1390.1517 1392.1417 1447.8982 1452.5942 1464.7210 1466.6398 1469.1737 1471.6087 1476.5101 1477.1877 1479.9709 1480.5900 1485.1329 1487.2352 1489.0274 1492.4569 2943.3952 2949.7518 2952.4455 2954.4962 2960.5476 2961.7741 2966.1500 2967.8277 2970.7447 2977.6268 2981.0307 2985.6085 2991.3149 2992.4373 3009.6052 3019.2961 3022.5085 3028.7657 3034.2718 3044.6830 3052.6961 3062.7542 3064.9383 3067.1593 3070.6775 3070.9929 3071.6448 3074.5031 3484.6457 3584.9084
redmass: 3.4548 2.6532 2.9586 3.9146 2.5445 1.8589 3.0910 2.8798 2.8187 2.7729 1.9269 2.2458 1.1127 2.3046 1.3888 1.2217 1.8965 1.8226 2.7753 1.2968 2.1807 2.9062 2.2457 2.6553 2.4412 2.3157 2.3609 2.4340 1.4754 2.1510 2.2205 2.2758 3.2674 1.0998 1.2709 2.0232 1.9570 1.8333 2.4639 1.9106 1.8294 1.4961 1.1851 1.7050 1.6223 2.0805 2.1101 2.3528 2.0237 2.0522 1.5189 2.2405 2.2607 2.0535 2.2676 2.1602 1.5324 1.7722 1.9236 2.2288 2.0172 1.6092 1.7510 1.4317 1.4445 1.4590 1.2297 1.2328 1.2513 1.2433 1.2269 1.1027 1.2653 1.2701 1.2894 1.4328 1.4681 1.4059 1.4408 1.3566 1.4368 1.5013 1.2986 1.2243 1.2193 1.5132 1.2201 1.2291 1.0868 1.0812 1.0696 1.0509 1.0721 1.0521 1.0572 1.0429 1.0658 1.0574 1.0684 1.0578 1.0475 1.0801 1.0744 1.0626 1.0601 1.0653 1.0616 1.0359 1.0381 1.0588 1.0366 1.0684 1.0460 1.0697 1.0820 1.0951 1.1013 1.0933 1.0988 1.0976 1.1024 1.0901 1.0987 1.0980 1.0993 1.1007 1.0993 1.0984 1.0987 1.0997 1.0643 1.0663
irintensity: 0.1510 0.3340 0.0599 1.0669 0.7272 0.5122 0.3110 1.8677 1.5965 0.8956 0.3146 1.0946 0.4374 2.3409 1.1842 0.5000 0.1512 12.4573 17.2539 76.4922 12.7610 1.6648 0.6754 4.8345 3.8383 0.3873 0.8254 7.7600 90.4454 40.3176 59.1971 15.5659 28.2674 7.5092 11.6599 10.1557 6.6760 7.0394 12.1241 18.4103 5.5905 9.6749 5.1070 20.1088 6.2135 19.8821 3.6454 6.2690 2.0558 48.4107 7.5896 2.1625 28.6586 1.4252 3.4475 7.6290 13.7365 25.4239 34.7872 0.5454 0.6017 21.0214 16.7362 6.6012 2.8722 3.0894 17.4725 8.6197 0.3058 3.2760 3.6025 3.5391 9.6558 1.3615 12.1982 1.0967 2.3881 2.8587 5.9383 6.7366 10.7759 1.7590 27.7157 25.9760 12.3378 21.1922 15.6146 18.0233 2.1485 4.4127 0.3569 2.4628 2.0918 8.3073 1.9328 12.4930 18.9195 3.9847 16.8865 13.5184 22.4901 2.8755 5.3822 14.9189 7.0198 22.0466 18.0717 43.3534 24.8431 96.5487 34.8123 34.0941 29.5074 54.6226 9.0806 13.3344 4.5913 1.6104 24.9032 10.4398 98.8798 38.2602 12.4817 96.2539 44.5536 92.7734 72.6977 44.6832 55.9700 58.5621 19.1892 5.3329
temp: 298.150 k
press: 1.00000 atm
elementType: 8 8 6 6 6 6 6 6 6 6 6 6 6 6 6 6 1 1 1 1 1 1 1 1 1 1 1 1 1 1 1 1 1 1 1 1 1 1 1 1 1 1 1 1 1 1
symmnumber: 1
zpe: 1093285.7 jmol-1
zpe.correction: 0.416411 hartree
zpe.thermalcorrener: 0.437994 hartree
zpe.thermalcorrenthalpy: 0.438938 hartree
zpe.thermalcorrgfe: 0.363886 hartree
zpe.sumelectzpe: -700.565509 hartree
zpe.sumelectthermal: -700.543925 hartree
zpe.sumelectthermalent: -700.542981 hartree
zpe.sumelectthermalfe: -700.618033 hartree
dipole: 1.9207 1.7412 1.2850
dipole: 2.8935
quadrupole: -108.0740 -100.2049 -105.6944
quadrupole: 0.4868 -2.4536 -3.2676
quadrupole: -3.4163 4.4529 -1.0366 0.4868 -2.4536 -3.2676
hfenergy: -700.9819194 hartree
pointgroup: C01 [X(C14H30O2)]
dipole: -0.7362284 0.6555402 -0.5693543 debye
polarizability: 185.3502825|1.7373172|152.6320846|1.2678984|0.485718|140.2085745 unknown
InChI: InChI=1S/C14H30O2/c1-5-7-8-12(6-2)10-14(16)13(15)9-11(3)4/h11-16H,5-10H2,1-4H3
charge 0 multiplicity 1
46 atoms
O  1.812838 2.39822 0.872747
O  1.990284 -0.096158 1.896754
C  -1.342522 0.391965 -0.251348
C  -0.399759 1.28637 0.603652
C  1.067042 1.342681 0.130468
C  -2.678573 0.175359 0.513289
C  1.867904 0.051104 0.435535
C  -1.550131 0.926024 -1.701079
C  3.250853 0.049374 -0.25176
C  -3.689071 -0.763628 -0.183416
C  4.106165 -1.209366 0.045373
C  -2.286043 2.281484 -1.81164
C  -4.921719 -1.072232 0.697677
C  3.490836 -2.488905 -0.570975
C  5.553254 -1.004484 -0.460414
C  -5.943883 -1.997033 0.002444
H  -0.864131 -0.6077 -0.347179
H  -0.812225 2.318872 0.625005
H  -0.397337 0.91766 1.648322
H  1.121851 1.565886 -0.954794
H  -2.437697 -0.244619 1.512029
H  -3.162679 1.156008 0.704937
H  1.277598 -0.824751 0.113331
H  -0.56571 1.008785 -2.203779
H  -2.113542 0.166893 -2.277535
H  3.79599 0.958339 0.071812
H  3.103162 0.137703 -1.350142
H  -4.035317 -0.315288 -1.136858
H  -3.184687 -1.716187 -0.451049
H  4.127961 -1.334633 1.146619
H  -1.746688 3.089786 -1.283963
H  -3.305297 2.226688 -1.38768
H  -2.382112 2.585762 -2.870002
H  -5.414914 -0.119321 0.97987
H  -4.583341 -1.538328 1.645581
H  1.236459 3.196527 0.964859
H  2.484639 -2.698601 -0.164894
H  3.406429 -2.393692 -1.671884
H  4.122994 -3.370949 -0.357363
H  6.185349 -1.882181 -0.228264
H  5.571273 -0.857985 -1.558551
H  6.019415 -0.116244 0.006129
H  2.271315 0.80248 2.222219
H  -6.325178 -1.538124 -0.929571
H  -5.482118 -2.965889 -0.266771
H  -6.811435 -2.206272 0.655058
