program: Gaussian 09
title: 000251254
version: EM64L-G09RevD.01
frameworkgroup: C1[X(C18H34O2)]
method: RPBEPBE
basis: SDD
operation: Freq
keyword: #pfreq=noraman
keyword: PBEPBE/SDD
title: #p freq=noraman PBEPBE/SDD
converged: YES YES NO NO
title: Mulliken charges:
elementType: O O C C C C C C C C C C C C C C C C C C H H H H H H H H H H H H H H H H H H H H H H H H H H H H H H H H H H
charge: -0.267361 -0.250090 0.038096 -0.450480 -0.451408 -0.445242 -0.402967 -0.404414 -0.382589 -0.394273 -0.371844 -0.382625 -0.521285 0.014390 -0.358806 -0.410862 -0.389826 0.249902 -0.723991 -0.711940 0.187376 0.195486 0.189527 0.185520 0.208634 0.196445 0.189105 0.191171 0.194676 0.195793 0.189429 0.187109 0.197322 0.208223 0.192310 0.192138 0.191547 0.229123 0.206178 0.247025 0.234496 0.204640 0.214591 0.237625 0.209096 0.208862 0.207940 0.193742 0.212578 0.212041 0.254360 0.212242 0.224833 0.216431
chargesum: 0.00000
title: Mulliken charges with hydrogens summed into heavy atoms:
elementType: O O C C C C C C C C C C C C C C C C C C
charge: -0.267361 -0.250090 0.225472 -0.065466 -0.057254 -0.059692 -0.017119 -0.019192 0.001842 0.006260 0.011841 0.052676 -0.039765 0.219030 0.093410 0.007096 0.011856 0.249902 -0.045012 -0.058434
polarizability: 2.62427041e+02 -4.93875746e+00 1.77361668e+02 -1.85033101e+00 -2.75435253e+00 1.63184922e+02
1716.lowfreq: -13.9029 -5.0806 -3.4326 -0.0016 -0.0014 0.0016 8.1988 17.9908 20.8629
frequency: -5.4317 17.9756 20.4802 32.7202 39.6593 55.2548 57.3610 69.3564 90.8633 101.7190 120.0320 122.4107 135.6763 147.6498 167.6330 198.6954 213.1721 215.4375 221.5405 248.4862 277.0941 294.2908 299.9817 311.7037 326.8036 352.5881 401.8265 430.0149 440.9933 457.5134 464.7330 512.3807 519.7304 550.8614 575.9597 668.2749 722.0300 739.3853 743.9750 763.6864 774.5277 782.6069 812.9420 813.4661 831.8118 840.9337 868.1929 888.8226 907.8208 908.5238 924.8207 937.1955 955.9743 968.2018 988.4771 1008.2863 1011.1312 1025.9932 1029.0322 1036.1265 1050.8589 1054.0676 1059.6599 1065.7563 1076.7935 1089.8787 1096.6732 1102.9609 1114.7464 1134.9001 1141.7690 1151.3948 1162.8508 1170.4784 1183.2118 1217.7670 1225.3829 1231.3438 1246.5200 1248.0471 1254.4543 1256.9218 1270.5670 1272.6919 1274.9209 1279.5292 1289.0427 1292.4532 1301.8696 1310.1437 1326.1510 1330.4277 1333.0556 1337.8338 1339.6168 1341.5825 1349.0436 1354.6541 1357.0625 1360.2040 1360.5499 1367.9069 1393.8986 1395.6975 1443.4153 1453.9491 1458.6121 1459.8507 1461.5414 1462.0861 1463.7984 1468.7226 1469.1699 1472.4743 1475.7395 1477.0028 1479.9623 1485.2573 1485.4181 1492.4530 1496.0083 1637.0273 2926.5014 2941.3841 2949.7899 2950.5641 2956.2338 2961.2487 2962.1392 2962.4377 2962.9048 2963.6169 2968.7331 2975.5688 2978.3066 2979.5300 2986.3136 2987.8093 2989.0490 2996.8269 3013.1174 3016.5292 3017.9181 3022.5007 3024.0789 3027.0451 3027.3440 3031.0706 3038.1824 3045.6474 3068.8947 3069.5903 3071.0598 3078.8299 3081.9564 3087.7060
redmass: 3.4569 3.4955 4.0085 4.0231 3.2978 3.6435 2.2127 3.6301 2.4239 2.8598 1.7967 1.9003 2.7456 3.9346 2.4015 2.6829 1.8721 2.1425 1.1581 2.4373 2.4286 2.5123 2.3884 1.8237 2.4935 4.0437 2.5530 2.7518 2.4014 2.2124 2.9044 2.5777 2.4572 1.9111 3.2950 4.4392 1.0928 1.2716 1.8419 1.3066 1.8790 1.6342 1.4681 1.3878 4.4263 2.0684 1.7037 1.6251 1.8321 1.7464 3.7004 1.4150 2.5084 1.9607 1.8346 1.6529 2.2200 1.7203 1.7126 2.6972 1.8363 1.1033 2.4590 2.4736 2.0014 1.9504 1.7732 2.1725 2.4919 1.9744 2.2160 1.9694 2.0243 2.4392 1.5182 1.4558 1.3077 1.2167 1.2898 1.2715 1.2712 1.2722 1.2116 1.1030 1.2515 1.2056 1.0878 1.1693 1.2642 1.2541 1.4107 1.4813 1.3910 1.6038 1.5108 1.4818 1.5237 1.4140 1.5350 1.5432 1.4778 1.4546 1.2230 1.2063 1.0858 1.0831 1.0803 1.0882 1.0880 1.0872 1.0696 1.0826 1.0609 1.0925 1.0679 1.0957 1.0567 1.0778 1.0725 1.0493 1.0654 9.0471 1.0807 1.0594 1.0622 1.0591 1.0633 1.0787 1.0592 1.0614 1.0626 1.0666 1.0602 1.0658 1.0376 1.0367 1.0837 1.0642 1.0753 1.0975 1.0978 1.0660 1.0904 1.0972 1.0978 1.1000 1.0996 1.1008 1.1034 1.0990 1.0988 1.0987 1.0993 1.1003 1.1010 1.1068
irintensity: 0.1326 0.1378 0.2016 0.5544 0.2636 0.9110 0.1452 0.3192 0.1417 0.8550 0.3290 0.1756 0.9304 0.2289 0.4070 1.9789 0.1019 0.9200 0.0391 2.9585 2.1671 0.2182 5.4105 0.3149 10.4660 5.9764 1.1538 0.0465 1.4428 0.0179 1.2440 6.7367 1.0461 0.3295 3.8339 3.6192 11.5958 0.9436 4.4310 12.0165 1.1337 0.4066 9.6070 2.1749 7.3668 7.6628 1.7525 10.9580 12.6764 0.4300 42.7861 5.7728 1.9628 0.8100 22.9675 12.0055 25.7833 17.9474 0.9398 3.8762 0.7389 1.4591 9.0730 16.4753 12.7529 46.8449 61.2067 26.5746 0.1063 7.6232 160.7180 1.5982 32.6950 2.6657 6.7044 7.7400 36.2726 11.6474 2.0229 6.0566 1.0731 3.9780 15.8990 1.4203 1.2817 0.4519 0.8130 0.7171 17.1368 0.5840 13.6496 0.8845 1.0638 0.7221 0.6756 9.5339 0.0225 1.1115 2.4435 1.2598 5.9956 11.4405 19.2005 16.4174 16.7721 0.3937 4.6212 3.1566 3.3427 9.1431 2.3197 16.8186 0.2286 5.1311 28.4309 1.3599 20.0026 10.0714 14.3052 11.5143 3.7006 142.0700 6.4823 8.4847 17.0444 16.7738 61.4864 14.3716 33.8103 94.5117 21.3145 17.6844 35.4261 2.9734 29.8953 32.1071 11.7376 31.2931 45.2201 3.1608 67.7309 41.2994 27.7331 99.0169 32.4704 9.4428 38.1876 47.3856 151.9050 49.0614 21.1689 70.0445 64.7097 33.1285 52.8236 17.3997
temp: 298.150 k
press: 1.00000 atm
elementType: 8 8 6 6 6 6 6 6 6 6 6 6 6 6 6 6 6 6 6 6 1 1 1 1 1 1 1 1 1 1 1 1 1 1 1 1 1 1 1 1 1 1 1 1 1 1 1 1 1 1 1 1 1 1
symmnumber: 1
zpe: 1278706.9 jmol-1
zpe.correction: 0.487034 hartree
zpe.thermalcorrener: 0.510264 hartree
zpe.thermalcorrenthalpy: 0.511208 hartree
zpe.thermalcorrgfe: 0.431501 hartree
zpe.sumelectzpe: -855.132981 hartree
zpe.sumelectthermal: -855.109751 hartree
zpe.sumelectthermalent: -855.108806 hartree
zpe.sumelectthermalfe: -855.188513 hartree
dipole: 0.5225 -1.4495 0.6106
dipole: 1.6573
quadrupole: -114.9032 -130.3701 -125.7668
quadrupole: -3.1913 -0.1700 3.0299
quadrupole: 8.7768 -6.6901 -2.0867 -3.1913 -0.1700 3.0299
hfenergy: -855.6200142 hartree
pointgroup: C01 [X(C18H34O2)]
dipole: 0.1986295 0.4200737 0.4574267 debye
polarizability: 262.3188082|0.4779226|166.5582858|6.0546787|6.6721757|174.0965361 unknown
InChI: InChI=1S/C18H34O2/c1-3-16(4-2)15-20-18(19)14-10-6-9-13-17-11-7-5-8-12-17/h16-17H,3-15H2,1-2H3
charge 0 multiplicity 1
54 atoms
O  3.587065 -0.02961 1.14456
O  2.59933 -1.155626 -0.652186
C  -5.203829 0.056333 0.295374
C  -6.38029 0.967455 0.736139
C  -5.426404 -0.426834 -1.162436
C  -3.846263 0.78011 0.485352
C  -7.75508 0.279872 0.561834
C  -6.799601 -1.117855 -1.344203
C  -7.961132 -0.2005 -0.894296
C  -2.599219 -0.103615 0.25338
C  -1.274679 0.624633 0.576414
C  -0.031899 -0.254742 0.319839
C  1.286077 0.468871 0.67259
C  5.956737 0.331424 0.443084
C  4.899212 -0.698261 0.888239
C  5.588011 1.024357 -0.899022
C  7.344524 -0.3720 0.427311
C  2.51896 -0.335204 0.292181
C  5.569536 0.105863 -2.142812
C  8.521464 0.571328 0.098854
H  -5.207527 -0.84249 0.953532
H  -6.239166 1.27478 1.792048
H  -6.358428 1.897476 0.128169
H  -5.3651 0.451793 -1.840509
H  -4.618879 -1.120894 -1.465269
H  -3.806079 1.658143 -0.194706
H  -3.80425 1.186952 1.518401
H  -7.815413 -0.593654 1.244302
H  -8.567924 0.972462 0.856242
H  -6.935976 -1.419249 -2.401368
H  -6.819716 -2.049628 -0.740948
H  -8.009802 0.682225 -1.565833
H  -8.928842 -0.730669 -0.990928
H  -2.568881 -0.449128 -0.799256
H  -2.676024 -1.016891 0.8803
H  -1.28789 0.955237 1.63639
H  -1.206756 1.548073 -0.036852
H  0.00198 -0.564953 -0.741536
H  -0.108204 -1.187521 0.913269
H  1.340834 0.722073 1.745967
H  1.337411 1.431215 0.121688
H  5.991833 1.122615 1.222616
H  5.178208 -1.147795 1.857326
H  4.749094 -1.492996 0.135867
H  4.593829 1.498991 -0.782203
H  6.300147 1.855272 -1.068326
H  7.329448 -1.208959 -0.2994
H  7.518812 -0.830898 1.422416
H  5.308416 0.689129 -3.044889
H  6.556333 -0.358825 -2.324403
H  4.818281 -0.697332 -2.041965
H  8.551975 1.428741 0.797692
H  8.445754 0.975372 -0.926659
H  9.486585 0.038038 0.176733
