program: Gaussian 09
title: 000251232
version: EM64L-G09RevD.01
frameworkgroup: C1[X(C14H30O2)]
method: RPBEPBE
basis: SDD
operation: Freq
keyword: #pfreq=noraman
keyword: PBEPBE/SDD
title: #p freq=noraman PBEPBE/SDD
converged: YES YES NO NO
title: Mulliken charges:
elementType: O O C C C C C C C C C C C C C C H H H H H H H H H H H H H H H H H H H H H H H H H H H H H H
charge: -0.458935 -0.449822 0.015442 -0.467622 -0.419181 -0.185615 -0.429249 -0.079241 -0.401570 -0.034597 -0.367446 -0.719883 -0.359396 -0.717793 -0.725170 -0.700986 0.184211 0.196456 0.215969 0.234002 0.233639 0.201257 0.181865 0.200843 0.200961 0.195085 0.207103 0.178096 0.219831 0.182718 0.216111 0.211312 0.215301 0.197556 0.189970 0.199545 0.257174 0.207909 0.215480 0.210871 0.221878 0.341112 0.346722 0.219418 0.212833 0.205835
chargesum: 0.00000
title: Mulliken charges with hydrogens summed into heavy atoms:
elementType: O O C C C C C C C C C C C C C C
charge: -0.117822 -0.103100 0.199653 -0.055198 0.048461 0.015642 -0.046542 0.121720 0.000618 0.143499 0.035104 -0.077159 0.028130 -0.053164 -0.076941 -0.062900
polarizability: 1.70405057e+02 -3.27646235e+00 1.69024307e+02 2.52421790e+00 7.42144577e-01 1.37809270e+02
1716.lowfreq: -3.6814 0.0007 0.0010 0.0010 3.5692 12.3947 18.9635 21.3628 40.0854
frequency: 16.4036 21.1162 39.6860 55.9940 66.0271 76.5363 82.9821 100.1516 126.9050 142.3076 161.2677 174.2649 198.9709 214.4049 223.3820 232.9524 243.1864 257.2424 266.7046 288.8157 295.1669 302.8601 325.3054 345.6110 386.0741 421.8433 439.5610 452.0843 469.0812 491.6519 539.3917 565.5252 669.4085 733.2752 752.3648 766.7460 787.0827 810.0959 828.0500 865.4230 892.6394 908.8825 917.8553 923.5082 933.8922 950.0928 970.0500 971.4320 1000.3715 1011.8612 1024.9729 1038.5478 1052.3988 1056.5179 1081.6328 1091.4760 1099.4410 1120.3420 1126.4355 1141.5023 1165.4568 1170.6196 1186.5564 1209.5243 1219.2971 1230.8915 1244.4033 1258.3423 1266.0056 1269.3349 1283.5546 1291.0440 1293.7052 1296.9369 1302.3067 1323.2506 1328.6536 1339.3271 1345.2540 1348.8037 1355.5662 1356.9788 1366.4686 1375.3721 1387.8594 1389.1333 1394.9825 1396.0572 1462.7797 1464.6370 1466.2346 1466.5740 1471.2490 1471.6152 1475.9671 1477.2347 1480.6651 1482.6698 1483.2264 1488.0584 1491.8717 1495.3680 2931.8913 2936.7011 2950.4548 2955.6520 2964.9107 2968.3972 2970.8676 2971.1948 2972.9365 2974.5675 2976.6921 2989.7611 2993.3003 3002.0212 3006.3251 3016.0885 3017.7214 3026.2969 3033.8905 3060.4456 3065.3620 3066.6345 3067.1257 3067.2949 3071.2238 3071.4771 3071.8796 3099.1323 3465.7425 3550.1423
redmass: 3.6888 3.5184 3.6706 2.7268 2.9617 1.6487 2.9600 3.0939 2.5840 2.0321 2.9992 2.0190 1.8593 1.2979 1.2310 1.2224 1.3389 2.1020 3.3258 3.0032 1.2415 2.7159 2.3542 2.5067 2.7131 2.8718 2.8895 2.8604 2.9151 2.6225 1.1159 2.2684 2.8597 1.0884 1.3073 1.6589 1.8187 1.6673 1.5986 2.5229 1.8652 2.0261 1.2504 1.4209 2.2212 1.7025 2.0771 2.1471 2.4830 1.8389 1.4538 2.1707 2.7626 1.9352 2.3930 1.9672 1.6265 1.6497 1.8302 2.0416 2.6848 1.6438 1.4787 1.5040 1.4877 1.3748 1.3085 1.2404 1.2921 1.3442 1.1603 1.2622 1.1390 1.2267 1.4274 1.2415 1.3814 1.4300 1.3521 1.5345 1.4578 1.4110 1.4162 1.2048 1.2162 1.2199 1.3386 1.2923 1.0740 1.0696 1.0608 1.0623 1.0542 1.0625 1.0554 1.0436 1.0655 1.0735 1.0500 1.0805 1.0515 1.0710 1.0811 1.0819 1.0601 1.0599 1.0596 1.0588 1.0368 1.0367 1.0421 1.0374 1.0580 1.0822 1.0947 1.0624 1.1014 1.0999 1.0953 1.0858 1.1034 1.0990 1.1012 1.0993 1.1001 1.0996 1.0986 1.1000 1.0993 1.0987 1.0645 1.0660
irintensity: 0.3113 0.8436 0.9897 0.0076 0.4323 0.1081 0.9017 0.1454 0.1110 0.9827 2.4208 0.0380 0.6411 0.6909 3.3115 0.0296 0.1897 4.1361 15.8391 2.1586 71.2678 11.2186 1.0371 0.3252 4.1449 10.1461 2.2696 2.7419 1.9109 0.6104 193.7093 17.4556 11.7824 6.2190 8.4924 19.3315 1.6251 12.0214 4.4480 5.3012 9.0544 13.9945 3.2936 4.6047 9.6842 24.0548 36.2702 32.3552 15.7777 3.4023 13.7096 2.7877 1.3240 12.6987 1.2082 1.6558 23.8873 10.7862 3.3126 12.0089 1.1116 9.2158 11.0553 4.4455 17.1785 15.4717 8.6746 4.7116 6.8849 1.7864 1.2215 2.5922 4.1521 13.1104 1.1983 1.5008 0.7610 5.1492 4.1207 2.4707 13.5112 16.4293 5.7636 12.9304 10.1950 20.0430 31.2399 6.1747 2.0112 0.2709 5.6938 2.7743 4.8108 0.7893 8.8609 12.9953 2.6832 24.9072 10.5366 18.5555 25.8764 5.9034 21.3105 28.7028 2.4084 7.5959 34.8633 105.7719 17.3737 38.5171 18.0191 31.0919 31.9871 45.4599 7.6648 31.3205 0.3435 31.9117 20.6502 45.5511 85.8595 16.6101 32.6562 8.3605 69.0103 123.7335 131.1194 35.7289 35.1968 16.7208 19.0399 2.9969
temp: 298.150 k
press: 1.00000 atm
elementType: 8 8 6 6 6 6 6 6 6 6 6 6 6 6 6 6 1 1 1 1 1 1 1 1 1 1 1 1 1 1 1 1 1 1 1 1 1 1 1 1 1 1 1 1 1 1
symmnumber: 1
zpe: 1094222.5 jmol-1
zpe.correction: 0.416767 hartree
zpe.thermalcorrener: 0.438164 hartree
zpe.thermalcorrenthalpy: 0.439108 hartree
zpe.thermalcorrgfe: 0.364960 hartree
zpe.sumelectzpe: -700.564125 hartree
zpe.sumelectthermal: -700.542728 hartree
zpe.sumelectthermalent: -700.541784 hartree
zpe.sumelectthermalfe: -700.615932 hartree
dipole: -1.3459 -1.7253 -1.2887
dipole: 2.5395
quadrupole: -94.2661 -108.4795 -105.0501
quadrupole: 4.1558 -0.5422 0.2759
quadrupole: 8.3324 -5.8809 -2.4515 4.1558 -0.5422 0.2759
hfenergy: -700.9808922 hartree
pointgroup: C01 [X(C14H30O2)]
dipole: -0.5448642 0.6921383 0.4714475 debye
polarizability: 170.4188694|3.1987511|169.1019249|-2.0885771|-0.4279526|137.7178401 unknown
InChI: InChI=1S/C14H30O2/c1-5-7-8-12(6-2)9-10-13(15)14(16)11(3)4/h11-16H,5-10H2,1-4H3
charge 0 multiplicity 1
46 atoms
O  -2.12495 1.319173 -1.961062
O  -1.762638 -1.314457 -1.142594
C  2.24865 1.106263 0.497066
C  0.696206 1.128232 0.607693
C  -0.046906 1.118756 -0.748133
C  -1.574628 1.06595 -0.595457
C  2.788663 -0.175837 -0.198639
C  -2.107078 -0.313056 -0.116632
C  2.829931 2.371101 -0.195715
C  -3.632479 -0.34933 0.19685
C  2.299985 -1.510977 0.408561
C  2.496982 3.704308 0.509542
C  3.03909 -2.73913 -0.171336
C  -4.04162 -1.777161 0.627421
C  -4.031896 0.680961 1.283044
C  2.524531 -4.076109 0.404593
H  2.634727 1.099188 1.541652
H  0.38933 2.023333 1.186691
H  0.382431 0.254607 1.210967
H  0.194556 2.031399 -1.324539
H  0.270048 0.251746 -1.356211
H  -1.906073 1.866022 0.097248
H  3.89788 -0.148061 -0.15143
H  2.530898 -0.152057 -1.277843
H  -1.558502 -0.626996 0.7915
H  3.932281 2.257926 -0.246679
H  2.480075 2.410844 -1.2472
H  -4.180169 -0.109758 -0.742677
H  1.213355 -1.636063 0.227608
H  2.438717 -1.489604 1.510702
H  1.41391 3.92441 0.483406
H  2.809873 3.680272 1.571016
H  3.017627 4.550325 0.023951
H  2.923662 -2.74286 -1.274553
H  4.1262 -2.640252 0.027714
H  -3.594533 -2.027599 1.609299
H  -3.686159 -2.517933 -0.107974
H  -5.139654 -1.863707 0.723267
H  -3.428443 0.535809 2.200115
H  -3.901833 1.729066 0.955834
H  -5.093861 0.550612 1.560564
H  -3.091337 1.528818 -1.88802
H  -1.92464 -0.861094 -2.015911
H  1.448096 -4.209069 0.187414
H  3.066409 -4.939207 -0.024528
H  2.65189 -4.109401 1.503516
