program: Gaussian 09
title: 000251245
version: EM64L-G09RevD.01
frameworkgroup: C1[X(C16H16Cl2O)]
method: RPBEPBE
basis: SDD
operation: Freq
keyword: #p
keyword: freq=noraman
keyword: PBEPBE/SDD
title: #p freq=noraman PBEPBE/SDD
converged: YES YES NO NO
title: Mulliken charges:
elementType: Cl Cl O C C C C C C C C C C C C C C C C H H H H H H H H H H H H H H H H
charge: -0.056920 -0.065302 -0.311932 -0.136104 -0.102330 0.458642 0.452188 -0.710812 -0.702619 -0.432465 -0.383551 -0.350183 -0.413192 -0.198992 -0.207330 -0.218738 -0.213349 -0.112936 -0.105941 0.189889 0.212817 0.220215 0.233782 0.233406 0.237113 0.230492 0.211253 0.238013 0.276601 0.269485 0.237970 0.255726 0.253379 0.257218 0.254503
chargesum: 0.00000
title: Mulliken charges with hydrogens summed into heavy atoms:
elementType: Cl Cl O C C C C C C C C C C C C C C C C
charge: -0.056920 -0.065302 -0.311932 0.053786 0.110488 0.458642 0.452188 -0.023409 -0.023760 -0.194452 -0.106949 -0.080698 -0.175222 0.056734 0.046049 0.038480 0.041154 -0.112936 -0.105941
polarizability: 2.38247607e+02 -5.58954987e+00 1.92359759e+02 -2.96650844e+01 -3.14884724e+00 1.43589488e+02
1716.lowfreq: -5.2145 -1.2251 0.0027 0.0028 0.0034 6.7956 13.3273 21.5027 34.1374
frequency: 11.6151 21.0653 34.0431 45.1790 64.3030 95.9226 108.6060 151.1513 163.8471 197.7155 209.1494 223.0167 229.7659 245.7573 276.2505 303.3093 319.9160 347.6989 389.1636 405.1730 407.5025 410.4630 438.7247 455.1552 531.1551 541.1780 549.2860 621.5278 626.5037 640.0441 655.8770 718.1229 723.3690 765.6855 777.3159 818.7656 827.0469 829.5569 837.8329 841.0597 929.6644 951.0026 952.2547 974.6301 978.7530 984.7048 999.3699 1001.4997 1005.9366 1055.7788 1069.6536 1070.6185 1072.1963 1083.6637 1096.8523 1111.4992 1124.7133 1179.5465 1180.7762 1207.8501 1215.6674 1281.5948 1284.0808 1293.9495 1306.3366 1311.4170 1337.6908 1379.5217 1382.3379 1383.1156 1388.9967 1395.2114 1397.9563 1459.4026 1463.9371 1467.8757 1470.7734 1477.0793 1480.2710 1587.7353 1589.1918 1598.7877 1603.4143 2946.4397 2961.6118 2984.8916 2994.4425 3078.4245 3095.9371 3097.4864 3100.8537 3122.4327 3125.4888 3143.6495 3157.0029 3168.4164 3170.2237 3171.4026 3177.1318
redmass: 9.4201 3.9239 4.1853 4.3086 5.3929 5.8662 4.5765 5.0810 4.5811 2.1435 3.5873 1.4732 1.1597 4.2003 6.2216 4.3738 4.9263 5.4057 4.5426 3.7816 2.9312 3.3140 5.2603 4.9355 2.8684 2.9131 3.7247 6.5555 7.0464 4.3994 4.2517 3.5298 3.5416 3.9426 3.2908 2.2402 1.4752 1.4523 1.3319 1.3283 2.5767 1.3392 1.3517 1.3533 1.3685 2.4228 4.2104 3.7674 2.2836 2.1157 2.3810 2.3415 2.3924 2.1200 1.7108 1.4028 1.8444 1.1143 1.1137 2.3315 2.0176 1.3520 1.3322 1.2387 1.3679 1.5762 1.7246 2.6184 1.6742 3.8729 1.3321 2.5355 2.2491 1.0762 1.1323 1.0496 1.2702 1.6689 2.1881 7.3591 7.5227 6.2351 6.2760 1.0833 1.0837 1.0357 1.0350 1.0992 1.1006 1.0999 1.1009 1.0899 1.0898 1.0890 1.0886 1.0951 1.0951 1.0963 1.0969
irintensity: 0.1278 0.0927 0.6656 0.7922 0.2674 1.5378 0.0318 1.5204 1.3659 0.4079 0.4053 0.1116 0.1530 0.9162 0.4125 1.5308 1.9243 4.0539 2.1675 6.6953 0.5531 2.6847 9.2476 17.6600 24.9357 34.1401 15.1052 1.0668 0.8209 7.5602 8.8493 2.8845 4.3763 18.0536 7.4232 4.9019 44.6179 32.4538 24.9673 24.8678 46.6695 1.5688 1.1819 2.2489 5.4739 21.9297 54.5765 18.6840 72.9825 152.0750 22.7116 76.7640 16.8247 11.4236 10.0575 5.7895 1.2360 1.2349 0.4933 9.1304 8.3876 23.3330 16.6684 5.1172 4.9720 14.2079 8.2025 6.8404 19.7636 3.6132 22.1509 8.9183 6.5040 8.6142 3.3005 14.1118 21.4010 43.4480 82.0345 3.1015 1.7472 15.1741 7.6771 37.9860 20.3989 26.2925 19.2475 47.7313 15.1200 26.6645 34.1295 11.4659 11.5124 2.0465 1.5331 6.2893 5.1656 0.7421 1.5234
temp: 298.150 k
press: 1.00000 atm
elementType: 17 17 8 6 6 6 6 6 6 6 6 6 6 6 6 6 6 6 6 1 1 1 1 1 1 1 1 1 1 1 1 1 1 1 1
symmnumber: 1
zpe: 717412.3 jmol-1
zpe.correction: 0.273248 hartree
zpe.thermalcorrener: 0.291859 hartree
zpe.thermalcorrenthalpy: 0.292803 hartree
zpe.thermalcorrgfe: 0.222903 hartree
zpe.sumelectzpe: -1613.263678 hartree
zpe.sumelectthermal: -1613.245067 hartree
zpe.sumelectthermalent: -1613.244123 hartree
zpe.sumelectthermalfe: -1613.314023 hartree
dipole: -1.6402 2.8855 1.4136
dipole: 3.6076
quadrupole: -145.9329 -124.1994 -120.0109
quadrupole: -5.7632 -2.1282 -0.0113
quadrupole: -15.8851 5.8483 10.0368 -5.7632 -2.1282 -0.0113
hfenergy: -1613.5369258 hartree
pointgroup: C01 [X(C16H16Cl2O1)]
dipole: 0.6469763 1.1699215 -0.4766683 debye
polarizability: 233.1257411|8.2240437|190.3697619|-36.2272463|9.0895555|150.7013508 unknown
InChI: InChI=1S/C16H16Cl2O/c1-11(13-3-7-15(17)8-4-13)19-12(2)14-5-9-16(18)10-6-14/h3-12H,1-2H3
charge 0 multiplicity 1
35 atoms
Cl 4.898523 -2.940861 -0.810719
Cl -5.932785 -1.700513 0.769225
O  -0.038674 1.641735 0.568126
C  1.393366 1.98237 0.44084
C  -0.693753 1.208657 -0.687776
C  2.239636 0.754887 0.098845
C  -1.9663 0.467189 -0.296104
C  1.779899 2.597339 1.796496
C  -1.001963 2.425645 -1.592245
C  3.325822 0.853748 -0.80359
C  -2.635817 0.752391 0.91918
C  1.971776 -0.494279 0.714594
C  -2.522031 -0.493124 -1.176769
C  4.14532 -0.263983 -1.084792
C  -3.842835 0.096221 1.250662
C  2.773881 -1.623375 0.442609
C  -3.728715 -1.157814 -0.863287
C  3.853681 -1.487092 -0.4527
C  -4.372018 -0.847282 0.349862
H  1.528392 2.746216 -0.355722
H  -0.018317 0.509965 -1.226097
H  2.8452 2.887248 1.800656
H  1.614369 1.866376 2.606968
H  1.163553 3.490368 1.997246
H  -1.651411 3.138844 -1.055552
H  -1.526273 2.101247 -2.509114
H  -0.076983 2.947757 -1.89781
H  3.542051 1.809735 -1.296741
H  -2.196922 1.476845 1.610862
H  1.116598 -0.581841 1.393966
H  -2.011179 -0.737498 -2.116281
H  4.98468 -0.185864 -1.781775
H  -4.358593 0.313866 2.190552
H  2.564261 -2.587996 0.91396
H  -4.153339 -1.902528 -1.542476
