program: Gaussian 09
title: 000251230
version: EM64L-G09RevD.01
frameworkgroup: C1[X(C14H30O)]
method: RPBEPBE
basis: SDD
operation: Freq
keyword: #pfreq=noraman
keyword: PBEPBE/SDD
title: #p freq=noraman PBEPBE/SDD
converged: YES YES NO NO
title: Mulliken charges:
elementType: O C C C C C C C C C C C C C C H H H H H H H H H H H H H H H H H H H H H H H H H H H H H H
charge: -0.466181 0.315981 -0.007526 -0.474189 -0.500550 -0.461599 -0.458400 -0.398000 -0.372819 -0.385878 -0.723841 -0.345797 -0.708408 -0.697936 -0.702140 0.183194 0.203095 0.188761 0.230625 0.219915 0.202791 0.196572 0.207303 0.204939 0.248970 0.186619 0.225967 0.206356 0.208820 0.209134 0.324646 0.214787 0.212619 0.225618 0.191404 0.187708 0.207581 0.206910 0.218492 0.215620 0.211373 0.212479 0.214451 0.207675 0.212862
chargesum: 0.00000
title: Mulliken charges with hydrogens summed into heavy atoms:
elementType: O C C C C C C C C C C C C C C
charge: -0.141535 0.315981 0.175668 -0.082334 -0.050009 -0.062237 -0.046158 0.037589 0.059504 0.032076 -0.070818 0.033315 -0.075425 -0.058465 -0.067152
polarizability: 1.73839381e+02 -1.76686099e-01 1.57548632e+02 -6.60881514e-01 2.87499715e-02 1.36183065e+02
1716.lowfreq: -14.4531 -1.6684 -0.0007 0.0005 0.0008 13.6103 27.3842 44.2498 57.3756
frequency: 26.3698 44.1630 57.3351 63.1001 71.2951 79.3628 92.2847 114.5580 121.8980 142.9276 148.1319 179.0797 216.4850 227.9282 236.0788 238.5798 240.0844 271.3816 285.4503 293.5105 300.9801 331.9553 341.0098 352.4216 374.4075 399.7924 437.2438 522.5003 539.3424 645.6328 712.4732 730.5108 735.8117 748.7444 785.8470 795.3663 819.1013 851.0948 874.0495 893.1368 898.2045 902.0391 921.0710 952.4342 960.1652 975.0800 1017.1681 1028.3155 1053.4142 1053.6162 1056.5480 1072.7007 1084.1242 1088.9868 1099.2945 1113.8252 1137.5423 1142.0345 1162.9279 1170.5408 1217.9472 1227.3851 1234.5533 1246.3559 1263.6938 1273.2453 1281.9122 1286.2183 1286.8506 1292.1180 1299.4469 1302.4199 1315.0233 1322.2930 1339.2338 1344.1361 1351.9626 1361.4131 1369.6605 1388.2886 1389.1507 1389.2925 1390.6864 1456.8028 1463.1875 1467.6185 1472.5989 1474.5042 1476.5217 1476.7995 1476.9394 1478.2173 1479.1580 1480.4833 1484.4800 1486.4328 1489.0764 1492.9927 1503.9356 2937.3927 2954.7021 2961.4024 2965.2369 2968.1347 2970.5834 2971.4975 2971.6957 2974.2432 2975.9798 2979.5343 2982.0577 2999.8477 3001.3071 3008.0957 3015.1515 3017.4248 3023.6081 3036.0951 3046.0646 3051.0086 3066.4101 3066.9816 3068.1731 3068.6140 3069.5954 3070.2989 3071.8106 3080.6133 3549.9195
redmass: 3.0196 3.3066 2.6005 1.6478 2.3831 2.4825 1.9628 2.4019 1.8737 2.2103 2.4424 2.7112 2.5139 1.4994 1.1453 1.2702 1.1498 2.1746 3.0059 1.4406 1.9855 2.6504 2.9990 2.3613 2.1853 2.7946 3.6137 2.5647 2.9730 2.3792 1.9348 1.1226 1.1883 1.2720 1.3390 1.5264 1.5776 1.7330 1.4448 1.7692 1.7521 1.7680 1.5149 1.7312 1.8266 1.7500 1.7390 2.7591 2.0686 2.3518 2.6123 1.8894 1.7596 1.7835 1.8832 2.0212 2.2371 2.5419 2.0386 2.0682 1.3661 1.4043 1.3170 1.3825 1.3216 1.2689 1.1809 1.1054 1.3119 1.1854 1.2369 1.2140 1.3236 1.6704 1.4419 1.5034 1.5334 1.5150 1.5244 1.2189 1.2136 1.2092 1.2113 1.0808 1.0707 1.0649 1.0564 1.0531 1.0465 1.0498 1.0447 1.0438 1.0555 1.0630 1.0710 1.0715 1.0773 1.0869 1.0738 1.0802 1.0590 1.0590 1.0643 1.0367 1.0421 1.0535 1.0391 1.0560 1.0437 1.0586 1.0609 1.0959 1.0632 1.0945 1.0988 1.0936 1.0978 1.1011 1.1013 1.1007 1.1013 1.1000 1.0994 1.0991 1.0998 1.1007 1.0994 1.0996 1.0654
irintensity: 0.0416 0.0066 0.0290 0.2816 0.2943 0.0360 0.0439 0.2004 0.1210 0.6788 0.2742 2.2552 3.0532 3.1234 1.1086 3.1178 0.0581 12.6102 21.7964 79.3649 22.9511 0.2951 1.7587 35.4315 0.5209 1.8178 8.4139 1.2943 0.6683 6.1878 3.6058 12.5332 6.0705 6.8436 1.5268 6.5015 3.0102 17.1683 1.9129 5.2368 19.7961 20.3779 3.9643 9.1161 11.6206 0.3680 2.6313 4.4832 2.6836 2.6869 1.6260 2.1024 5.8256 11.0102 2.0439 12.5519 12.0240 18.8143 2.1088 7.6486 2.8134 2.7754 1.4753 6.3290 0.3968 10.6676 7.0113 5.1851 8.3851 10.4815 3.2655 2.7095 1.7745 11.5383 3.8832 1.8607 1.0208 5.2763 9.5056 13.2832 11.0203 8.4804 11.5885 4.2481 4.0500 0.5628 1.7588 0.7013 15.6741 5.2355 8.7270 7.5443 9.3148 5.0445 19.3669 21.3976 7.2442 7.3276 14.0018 19.7584 24.0683 14.9854 8.0046 44.3823 27.3304 47.6481 58.2829 6.2708 18.7841 76.6275 29.7906 15.0956 27.6488 29.8360 5.5161 26.2352 28.1833 11.5554 48.9521 14.9959 64.7309 73.6782 70.2626 37.3597 84.5380 75.3349 57.7460 57.7802 1.8778
temp: 298.150 k
press: 1.00000 atm
elementType: 8 6 6 6 6 6 6 6 6 6 6 6 6 6 6 1 1 1 1 1 1 1 1 1 1 1 1 1 1 1 1 1 1 1 1 1 1 1 1 1 1 1 1 1 1
symmnumber: 1
zpe: 1082548.5 jmol-1
zpe.correction: 0.412321 hartree
zpe.thermalcorrener: 0.432812 hartree
zpe.thermalcorrenthalpy: 0.433756 hartree
zpe.thermalcorrgfe: 0.363089 hartree
zpe.sumelectzpe: -625.424049 hartree
zpe.sumelectthermal: -625.403558 hartree
zpe.sumelectthermalent: -625.402614 hartree
zpe.sumelectthermalfe: -625.473281 hartree
dipole: 0.5059 -1.0740 1.2750
dipole: 1.7421
quadrupole: -99.4267 -95.4070 -101.3221
quadrupole: 0.3705 -0.1104 2.1388
quadrupole: -0.7081 3.3116 -2.6035 0.3705 -0.1104 2.1388
hfenergy: -625.8363699 hartree
pointgroup: C01 [X(C14H30O1)]
dipole: -0.1882075 -0.4187554 -0.5089238 debye
polarizability: 173.824299|0.5682498|157.5614797|-0.5858795|0.3096438|136.1852996 unknown
InChI: InChI=1S/C14H30O/c1-5-9-10-13(8-4)14(15,11-6-2)12-7-3/h13,15H,5-12H2,1-4H3
charge 0 multiplicity 1
45 atoms
O  -0.407279 -0.455587 1.668512
C  -0.802714 -0.154885 0.257775
C  0.254543 -0.753062 -0.758355
C  -2.213383 -0.774158 -0.001834
C  -0.852574 1.392824 0.243642
C  1.597106 0.03388 -0.844894
C  0.502814 -2.273865 -0.518692
C  2.512139 -0.019544 0.40209
C  -3.344075 -0.238914 0.906439
C  -1.312029 2.035794 -1.084099
C  1.351833 -2.952816 -1.617557
C  3.769964 0.866103 0.246486
C  -4.634912 -1.077465 0.786177
C  -1.271974 3.57831 -1.020024
C  4.707914 0.795499 1.470694
H  -0.222247 -0.668037 -1.760779
H  -2.488452 -0.621103 -1.065303
H  -2.15317 -1.872893 0.140071
H  -1.528979 1.712384 1.05844
H  0.14619 1.779636 0.519567
H  1.385274 1.094324 -1.083289
H  2.16461 -0.35054 -1.717054
H  -0.466639 -2.80526 -0.461616
H  1.007709 -2.424474 0.457363
H  1.939354 0.291034 1.295912
H  2.835878 -1.064491 0.58944
H  -2.989563 -0.2382 1.955256
H  -3.570248 0.814368 0.64939
H  -0.672303 1.689515 -1.919803
H  -2.343188 1.709103 -1.324493
H  -0.376929 -1.440476 1.777549
H  1.406849 -4.044697 -1.452097
H  0.911759 -2.784981 -2.61902
H  2.386515 -2.567131 -1.635023
H  3.455771 1.917618 0.080798
H  4.326043 0.562763 -0.66535
H  -5.008602 -1.093204 -0.255708
H  -4.458002 -2.126201 1.092831
H  -5.43967 -0.671333 1.426431
H  -1.622505 4.033135 -1.964797
H  -0.243908 3.940717 -0.83065
H  -1.914279 3.957162 -0.202652
H  4.183855 1.122377 2.388503
H  5.061021 -0.239723 1.638852
H  5.597585 1.439196 1.340168
