program: Gaussian 09
title: 000251204
version: EM64L-G09RevD.01
frameworkgroup: C1[X(C12H16O3)]
method: RPBEPBE
basis: SDD
operation: Freq
keyword: #pfreq=noraman
keyword: PBEPBE/SDD
title: #p freq=noraman PBEPBE/SDD
converged: YES YES NO NO
title: Mulliken charges:
elementType: O O O C C C C C C C C C C C C H H H H H H H H H H H H H H H H
charge: -0.256290 -0.257167 -0.265923 0.168386 -0.385394 -0.326411 -0.324556 0.356134 -0.719439 -0.357765 -0.385907 -0.358233 -0.358753 0.319802 -0.537427 0.200266 0.227794 0.225863 0.204106 0.202568 0.224939 0.226144 0.244712 0.227112 0.266326 0.262492 0.250048 0.239685 0.221601 0.219950 0.245337
chargesum: 0.00000
title: Mulliken charges with hydrogens summed into heavy atoms:
elementType: O O O C C C C C C C C C C C C
charge: -0.256290 -0.257167 -0.265923 0.168386 0.042666 0.103558 0.102952 0.356134 -0.021472 -0.091440 -0.123415 -0.108185 -0.119068 0.319802 0.149462
polarizability: 1.81380042e+02 5.22739429e+00 1.19940926e+02 -3.27891557e+00 1.08142052e+01 1.09938317e+02
1716.lowfreq: -14.2162 -6.2256 -0.0007 -0.0004 0.0004 7.0558 50.7056 62.1431 104.3409
frequency: 50.6426 62.1389 104.3228 122.6236 152.6368 194.9326 200.4118 204.9905 245.7705 250.6016 281.4645 307.7288 356.2855 364.4283 418.9173 438.4803 452.1578 472.4607 491.2474 525.4707 560.4427 606.8005 626.9772 635.8140 740.1994 762.7959 790.5475 815.3875 823.6402 846.2656 873.9488 885.2257 919.2570 926.0722 964.4759 985.9982 987.3989 1002.8468 1043.8902 1049.5973 1075.8056 1092.8898 1111.5085 1119.5907 1120.8773 1154.7945 1166.7271 1177.1352 1199.9225 1219.0142 1225.6489 1243.3534 1275.6959 1294.8391 1344.3193 1352.2880 1362.9973 1371.9320 1383.1143 1414.0992 1434.5607 1438.1379 1454.0785 1458.4604 1461.5779 1465.2134 1472.5962 1473.7283 1496.3958 1581.9374 1619.9103 2957.8280 2963.2013 2966.1365 2997.3118 3008.8014 3045.4037 3065.6582 3080.0047 3086.5779 3116.6842 3119.1303 3124.0757 3137.0731 3139.7468 3160.5645 3166.1235
redmass: 3.4749 3.7754 3.5483 3.4272 3.6518 2.1734 1.1383 1.8040 1.5665 3.3899 3.1989 3.5539 2.3561 4.6226 3.0591 4.5029 4.2632 3.4452 4.3572 2.9413 3.3530 2.5811 5.9669 5.0764 3.8621 5.1018 2.8375 3.2866 1.3710 1.5000 2.7761 2.1269 2.0083 2.7610 1.3187 1.3380 7.9131 2.8236 3.7223 2.1631 1.9341 1.5954 1.2602 2.3601 1.4700 1.3324 2.3638 1.4778 1.2234 1.3297 3.2317 3.5368 1.2653 1.2797 1.3745 1.3158 1.2830 4.9270 1.2419 3.8699 1.1733 1.0956 1.0580 1.0560 1.0741 1.0506 1.0792 1.0908 2.3781 7.4742 6.4048 1.0331 1.0667 1.0670 1.0615 1.0346 1.1039 1.0989 1.0971 1.1005 1.1003 1.1010 1.0992 1.0877 1.0882 1.0948 1.0963
irintensity: 1.6167 0.6138 5.2926 0.1849 4.2956 1.6733 0.1414 2.7577 0.7644 3.1672 1.5763 6.7697 10.6211 2.1517 0.1023 0.1102 1.0879 1.7308 8.2814 16.9265 21.4239 13.2334 2.5188 6.3156 1.0864 0.2699 33.2362 15.3808 21.5802 46.1615 19.1050 15.2240 7.6549 34.0286 2.7075 1.2037 46.6326 9.6896 104.7337 7.6671 13.9352 31.0517 0.1003 78.4025 0.9969 1.4127 140.8238 28.6081 0.2596 13.4320 118.6363 129.6224 7.2569 1.3425 4.6115 0.9793 5.3641 13.8860 29.7415 2.6327 9.0741 9.5382 0.8752 16.9560 0.0387 13.2541 48.5981 13.5665 79.6555 11.4010 72.2327 66.2976 24.5066 63.4712 39.7967 11.4953 49.3758 25.9907 39.8805 53.6221 12.6238 27.6214 26.3923 3.0775 3.9198 15.0647 5.3389
temp: 298.150 k
press: 1.00000 atm
elementType: 8 8 8 6 6 6 6 6 6 6 6 6 6 6 6 1 1 1 1 1 1 1 1 1 1 1 1 1 1 1 1
symmnumber: 1
zpe: 674351.5 jmol-1
zpe.correction: 0.256847 hartree
zpe.thermalcorrener: 0.271018 hartree
zpe.thermalcorrenthalpy: 0.271963 hartree
zpe.thermalcorrgfe: 0.216390 hartree
zpe.sumelectzpe: -691.375114 hartree
zpe.sumelectthermal: -691.360943 hartree
zpe.sumelectthermalent: -691.359998 hartree
zpe.sumelectthermalfe: -691.415571 hartree
dipole: 1.5684 2.4596 -1.0197
dipole: 3.0902
quadrupole: -81.3357 -86.2634 -88.2322
quadrupole: 3.5945 8.5291 -0.2002
quadrupole: 3.9414 -0.9863 -2.9551 3.5945 8.5291 -0.2002
hfenergy: -691.6319609 hartree
pointgroup: C01 [X(C12H16O3)]
dipole: -0.586413 -0.8834926 -0.5947269 debye
polarizability: 180.9737765|6.0333485|124.0364012|5.5292525|-7.7996661|106.2491072 unknown
InChI: InChI=1S/C12H16O3/c1-12(14-8-3-9-15-12)10-4-6-11(13-2)7-5-10/h4-7H,3,8-9H2,1-2H3
charge 0 multiplicity 1
31 atoms
O  2.401975 1.195924 -0.084927
O  2.262267 -1.053722 0.839291
O  -3.970548 0.209867 -0.557759
C  1.646546 0.289127 0.801688
C  3.270455 -0.714719 -1.398792
C  2.577226 0.657574 -1.453609
C  2.438333 -1.650354 -0.504673
C  0.166015 0.210456 0.387071
C  1.832215 0.857033 2.210149
C  -0.472212 1.321438 -0.224185
C  -0.611637 -0.927015 0.700743
C  -1.844687 1.289703 -0.527003
C  -1.992534 -0.977071 0.403468
C  -2.611092 0.138081 -0.214607
C  -4.810171 -0.94755 -0.241754
H  3.358795 -1.139571 -2.417985
H  4.2856 -0.602103 -0.977399
H  3.186634 1.413672 -1.974182
H  1.591424 0.574377 -1.958125
H  1.447721 -1.845245 -0.967536
H  2.945495 -2.610752 -0.318443
H  1.312755 0.219416 2.94404
H  2.907867 0.887528 2.447752
H  1.416928 1.876771 2.262092
H  0.122478 2.210992 -0.460023
H  -0.125812 -1.781931 1.18468
H  -2.34613 2.139828 -0.999826
H  -2.565434 -1.873814 0.658331
H  -4.829628 -1.146406 0.84767
H  -4.466366 -1.854109 -0.777411
H  -5.818171 -0.673927 -0.586435
