program: Gaussian 09
title: 000251203
version: EM64L-G09RevD.01
frameworkgroup: C1[X(C12H16O2)]
method: RPBEPBE
basis: SDD
operation: Freq
keyword: #pfreq=noraman
keyword: PBEPBE/SDD
title: #p freq=noraman PBEPBE/SDD
converged: YES YES NO NO
title: Mulliken charges:
elementType: O O C C C C C C C C C C C C H H H H H H H H H H H H H H H H
charge: -0.297717 -0.234179 -0.074799 -0.550294 -0.303254 -0.729833 0.121863 0.287321 -0.341572 -0.352660 -0.490755 -0.247102 -0.229494 -0.224554 0.228276 0.270019 0.232998 0.188228 0.239265 0.237360 0.206287 0.210688 0.250277 0.276952 0.203297 0.200439 0.227915 0.230044 0.232384 0.232599
chargesum: 0.00000
title: Mulliken charges with hydrogens summed into heavy atoms:
elementType: O O C C C C C C C C C C C C
charge: -0.297717 -0.234179 0.153478 -0.047277 0.124239 -0.075498 0.121863 0.287321 -0.091294 -0.075707 0.140896 -0.017057 0.002889 0.008045
polarizability: 1.74706342e+02 1.40810588e+01 9.64117571e+01 -9.09208509e+00 7.17246839e+00 1.28972935e+02
1716.lowfreq: -0.0006 -0.0005 0.0004 2.9356 7.5372 13.7959 28.1636 37.0988 58.3563
frequency: 27.8788 37.0218 58.3462 84.0378 111.2525 127.1967 153.5477 191.2876 210.1243 228.7007 239.8868 279.4609 317.1590 377.2974 399.9887 402.8292 412.9578 471.9209 537.1879 600.9442 614.1126 648.4501 696.8462 767.4487 781.1652 829.2104 859.1484 868.6021 894.8601 944.5030 953.1499 962.8204 989.8717 991.3879 1004.9096 1010.3008 1027.4014 1045.6149 1072.6778 1084.8438 1107.1152 1126.5742 1146.0740 1158.8759 1172.8031 1185.5758 1190.6152 1220.8951 1232.9561 1288.1983 1314.9523 1334.9681 1350.3152 1365.9444 1386.3554 1387.4429 1421.4353 1436.2941 1440.1599 1456.9463 1467.5778 1471.6807 1478.8153 1485.7051 1491.1972 1568.0830 1598.1801 1612.2328 2920.0266 2929.2663 2969.0686 2977.0995 2992.9792 2997.6292 3004.1941 3028.0717 3067.9518 3086.6634 3095.4233 3127.6179 3138.1891 3150.0575 3158.9649 3168.9281
redmass: 4.3501 3.7178 4.4723 2.6037 3.8727 2.4941 3.9970 2.3791 1.8097 1.2460 1.8246 2.9683 3.5909 3.2574 2.8207 2.6134 3.2578 4.5088 2.3334 3.2400 6.4262 6.3604 1.8087 1.6988 5.1472 3.2621 1.2603 2.8101 1.6015 1.6802 1.8741 1.7123 6.1694 1.3825 2.4766 1.3542 1.9607 3.3388 2.3441 1.5969 1.4565 1.6659 1.3562 1.8092 1.0714 1.1711 1.2437 2.2020 1.1570 1.7668 1.3671 1.6924 1.7150 1.2847 1.2211 9.2716 1.1187 2.1874 1.1468 1.0514 1.0551 1.0547 2.2111 1.0584 1.0746 6.7633 6.7390 6.4288 1.0400 1.0540 1.0609 1.0367 1.1015 1.1007 1.0854 1.0956 1.0993 1.0995 1.0973 1.0850 1.0881 1.0923 1.0958 1.1011
irintensity: 0.4210 0.7147 1.9558 9.9328 1.4460 3.0076 0.1060 6.6938 0.2930 1.7894 12.7201 0.0571 4.8816 2.0210 0.0308 0.6611 1.3365 4.7340 0.7499 8.9588 0.1349 13.2499 49.9398 61.8063 2.4714 4.3713 0.1975 17.5104 14.1437 12.1183 17.6394 0.8273 1.8599 0.4514 20.4021 0.9091 1.0860 93.0139 35.2010 8.7103 4.0772 9.9402 1.0631 14.2317 2.7398 31.5798 2.1056 92.0270 12.1215 76.5814 1.5583 9.1582 60.7483 14.1055 9.6297 2.8053 22.3794 24.4058 1.2410 11.2964 18.8313 5.0724 0.7116 9.7558 18.3604 91.7739 34.4355 8.4460 57.2025 115.0619 35.3889 33.1037 116.2010 10.3866 13.0609 11.1381 51.9883 31.1913 30.8177 0.0414 7.5210 14.9038 24.6481 20.2146
temp: 298.150 k
press: 1.00000 atm
elementType: 8 8 6 6 6 6 6 6 6 6 6 6 6 6 1 1 1 1 1 1 1 1 1 1 1 1 1 1 1 1
symmnumber: 1
zpe: 658104.3 jmol-1
zpe.correction: 0.250659 hartree
zpe.thermalcorrener: 0.265205 hartree
zpe.thermalcorrenthalpy: 0.266149 hartree
zpe.thermalcorrgfe: 0.207753 hartree
zpe.sumelectzpe: -616.242840 hartree
zpe.sumelectthermal: -616.228294 hartree
zpe.sumelectthermalent: -616.227350 hartree
zpe.sumelectthermalfe: -616.285746 hartree
dipole: 0.8011 0.4720 -1.6269
dipole: 1.8739
quadrupole: -70.2425 -81.7493 -85.9682
quadrupole: -1.1122 -3.9897 2.1074
quadrupole: 9.0775 -2.4293 -6.6482 -1.1122 -3.9897 2.1074
hfenergy: -616.4934985 hartree
pointgroup: C01 [X(C12H16O2)]
dipole: 0.3512902 -0.1795873 0.6227823 debye
polarizability: 176.9232125|-8.0109541|94.3184828|6.5530819|7.1461842|128.8493384 unknown
InChI: InChI=1S/C12H16O2/c1-10(9-14-2)8-12(13)11-6-4-3-5-7-11/h3-7,10H,8-9H2,1-2H3
charge 0 multiplicity 1
30 atoms
O  -3.00033 -1.308388 0.777834
O  -0.252906 0.163826 -1.912773
C  -2.435237 0.8466 -0.216056
C  -0.993757 0.761424 0.336659
C  -3.002585 -0.559177 -0.489613
C  -3.349384 1.637541 0.747148
C  0.057053 0.349919 -0.696834
C  1.484857 0.182068 -0.247273
C  1.887737 0.367799 1.103071
C  2.462152 -0.173198 -1.217028
C  -3.504759 -2.666763 0.614465
C  3.239548 0.201512 1.473436
C  3.811001 -0.339687 -0.847183
C  4.203638 -0.152353 0.500769
H  -2.399667 1.359438 -1.197739
H  -0.97692 0.045982 1.182702
H  -0.691282 1.7436 0.755936
H  -4.044167 -0.480585 -0.875167
H  -2.383932 -1.087162 -1.244615
H  -3.426316 1.121882 1.720638
H  -2.960996 2.65893 0.917997
H  -4.370748 1.729282 0.332648
H  1.151929 0.638373 1.867172
H  2.131652 -0.310941 -2.252067
H  -2.886113 -3.248637 -0.102607
H  -4.557189 -2.67094 0.256469
H  -3.456471 -3.141738 1.60761
H  3.542326 0.345451 2.516422
H  4.556649 -0.613768 -1.601552
H  5.252619 -0.28139 0.790529
