program: Gaussian 09
title: 000251202
version: EM64L-G09RevD.01
frameworkgroup: C1[X(C12H10Cl4O4)]
method: RPBEPBE
basis: SDD
operation: Freq
keyword: #p
keyword: freq=noraman
keyword: PBEPBE/SDD
title: #p freq=noraman PBEPBE/SDD
converged: YES YES NO NO
title: Mulliken charges:
elementType: Cl Cl Cl Cl O O O O C C C C C C C C C C C C H H H H H H H H H H
charge: 0.051587 0.040184 0.066998 0.065703 -0.262562 -0.235115 -0.191289 -0.222250 0.380375 0.399996 -0.370784 -0.314716 -0.100233 -0.099203 0.131014 0.147671 -0.248617 -0.256221 -0.663790 -0.660423 0.244287 0.222576 0.228890 0.233481 0.221322 0.229800 0.255489 0.220512 0.251309 0.234008
chargesum: 0.00000
title: Mulliken charges with hydrogens summed into heavy atoms:
elementType: Cl Cl Cl Cl O O O O C C C C C C C C C C C C
charge: 0.051587 0.040184 0.066998 0.065703 -0.262562 -0.235115 -0.191289 -0.222250 0.380375 0.399996 -0.370784 -0.314716 -0.100233 -0.099203 0.131014 0.147671 0.218246 0.206151 0.042821 0.045405
polarizability: 2.36843714e+02 -2.04569206e+00 2.27435548e+02 -4.00261675e+00 -6.70322311e+00 1.03801783e+02
1716.lowfreq: -6.6539 -2.5598 0.0029 0.0033 0.0036 2.7321 18.7482 31.3851 40.4672
frequency: 17.8786 31.3419 40.3651 47.9393 53.5856 70.2346 77.5276 85.0044 101.0125 108.5534 147.8712 169.0676 189.6467 196.9012 200.9387 207.4795 217.5604 219.0274 239.4347 267.7568 285.5272 304.2622 311.5318 323.7419 344.5301 377.1394 401.0234 424.9755 453.4512 542.8250 573.4902 607.0199 626.3993 642.0653 699.0296 713.4491 744.8778 762.6186 776.2849 800.4656 805.7099 817.4865 823.3245 870.1781 885.1087 999.8540 1006.3097 1044.3779 1095.5042 1097.1649 1120.6088 1157.9234 1158.2543 1198.2900 1227.6455 1274.7688 1276.5529 1332.1992 1337.6832 1348.8761 1354.4674 1379.3989 1393.2224 1393.7163 1457.2228 1458.2729 1461.4324 1464.5717 1483.6932 1485.5305 1524.5939 1552.4642 1619.0820 1640.4170 2995.5198 2997.0054 3031.5398 3034.3718 3090.2908 3092.4004 3098.2106 3099.4081 3123.7437 3124.8729
redmass: 4.1217 5.9020 3.8140 4.6542 7.3820 3.2709 12.4689 4.8429 6.3774 5.9429 5.1851 7.7656 1.9108 7.7094 2.0167 7.0803 3.3981 8.0643 3.8017 4.0240 12.1285 3.4700 3.5326 21.1760 19.9008 9.7929 6.9711 3.8016 5.0039 10.3815 10.4805 10.9342 9.4421 10.0827 10.9228 4.7018 3.5785 8.2845 5.5746 2.7786 2.1650 1.7057 2.7118 4.9829 5.7799 2.7296 2.6783 8.8021 2.1705 2.1778 8.0239 1.6788 1.7012 8.2053 10.0944 1.1219 1.1207 7.2550 9.6666 1.4698 1.3747 5.6892 1.2275 1.2307 1.0939 1.0920 1.0500 1.0453 1.0529 1.0525 11.7819 11.9454 10.2706 10.8958 1.0363 1.0363 1.0602 1.0593 1.0973 1.0976 1.1036 1.1027 1.1065 1.1059
irintensity: 0.2922 0.2097 0.7309 1.2120 0.9122 0.3113 0.1165 0.7798 0.8259 1.5522 1.1005 1.3351 0.3134 0.2352 1.8944 0.2161 0.8403 0.1877 0.4532 0.0837 0.0783 15.7868 16.0299 0.3899 0.2633 0.6605 3.2987 3.4729 10.5062 13.2556 26.5489 30.4707 17.9510 30.9097 0.8133 3.8448 13.3940 2.7189 9.9362 9.2879 7.1549 9.1001 6.6040 5.3929 1.3835 26.6745 60.1048 59.1586 18.8765 38.3258 352.6479 14.4129 51.4049 285.1803 374.5099 7.8723 2.6593 78.1036 1.7168 9.0528 1.2714 36.0142 32.9052 18.2340 21.3147 5.7804 15.2490 14.3452 15.9107 15.1820 31.3691 20.0765 135.2014 188.2120 19.3965 15.5984 25.2015 23.1292 29.3653 32.0165 0.7568 1.7618 23.8699 28.3377
temp: 298.150 k
press: 1.00000 atm
elementType: 17 17 17 17 8 8 8 8 6 6 6 6 6 6 6 6 6 6 6 6 1 1 1 1 1 1 1 1 1 1
symmnumber: 1
zpe: 518205.0 jmol-1
zpe.correction: 0.197374 hartree
zpe.thermalcorrener: 0.219138 hartree
zpe.thermalcorrenthalpy: 0.220083 hartree
zpe.thermalcorrgfe: 0.143214 hartree
zpe.sumelectzpe: -2602.912870 hartree
zpe.sumelectthermal: -2602.891105 hartree
zpe.sumelectthermalent: -2602.890161 hartree
zpe.sumelectthermalfe: -2602.967030 hartree
dipole: -3.4477 1.2322 -2.7514
dipole: 4.5798
quadrupole: -125.1255 -136.0687 -149.9402
quadrupole: -1.4934 8.1308 4.6803
quadrupole: 11.9193 0.9761 -12.8954 -1.4934 8.1308 4.6803
hfenergy: -2603.1102434 hartree
pointgroup: C01 [X(C12H10Cl4O4)]
dipole: -1.4492589 0.4208205 -0.9844819 debye
polarizability: 234.2672073|-5.0367673|224.7107931|-17.8823062|-19.4567495|109.1030442 unknown
InChI: InChI=1S/C12H10Cl4O4/c1-3-19-11(17)5-6(12(18)20-4-2)8(14)10(16)9(15)7(5)13/h3-4H2,1-2H3
charge 0 multiplicity 1
30 atoms
Cl 1.721487 -3.20644 -0.045739
Cl 1.039586 3.151574 -0.646877
Cl 4.232115 -1.386359 -0.855935
Cl 3.886107 1.788038 -1.157326
O  -1.979865 -1.538821 -0.407584
O  -1.751985 1.811405 -1.048138
O  -0.925256 -2.395449 1.494507
O  -1.889095 1.085861 1.167174
C  0.251085 -0.834574 0.015114
C  0.0842 0.564494 -0.176249
C  1.519106 -1.420999 -0.197271
C  1.201618 1.356856 -0.52133
C  2.62885 -0.628744 -0.572113
C  2.472343 0.769698 -0.720875
C  -0.915768 -1.679047 0.473509
C  -1.274913 1.176276 0.079796
C  -3.239131 -2.272037 -0.045161
C  -3.083245 2.493216 -0.922951
C  -3.180872 -3.719134 -0.538993
C  -2.917328 3.902112 -0.34869
H  -3.366143 -2.21714 1.049913
H  -4.024521 -1.688992 -0.551494
H  -3.45539 2.50463 -1.959156
H  -3.734037 1.868139 -0.286566
H  -4.151051 -4.213578 -0.346368
H  -2.983594 -3.75811 -1.623956
H  -2.396021 -4.2846 -0.010405
H  -3.894706 4.419154 -0.358381
H  -2.557025 3.86547 0.692589
H  -2.207651 4.491701 -0.953143
