program: Gaussian 09
title: 000251187
version: EM64L-G09RevD.01
frameworkgroup: C1[X(C9H18O2)]
method: RPBEPBE
basis: SDD
operation: Freq
keyword: #pfreq=noraman
keyword: PBEPBE/SDD
title: #p freq=noraman PBEPBE/SDD
converged: YES YES NO NO
title: Mulliken charges:
elementType: O O C C C C C C C C C H H H H H H H H H H H H H H H H H H
charge: -0.489589 -0.237428 0.254575 -0.088651 -0.087473 0.122413 -0.738999 -0.736049 -0.730835 -0.740821 -0.767922 0.198340 0.244181 0.213316 0.242292 0.218450 0.206737 0.215515 0.256845 0.198033 0.251411 0.215755 0.220515 0.223423 0.228054 0.360446 0.258507 0.243305 0.245653
chargesum: 0.00000
title: Mulliken charges with hydrogens summed into heavy atoms:
elementType: O O C C C C C C C C C
charge: -0.129142 -0.237428 0.254575 0.109689 0.156708 0.122413 -0.064940 -0.056952 -0.065636 -0.068828 -0.020458
polarizability: 1.04760456e+02 1.31345782e+00 1.06202178e+02 1.09813280e+00 -1.89956862e+00 9.69138767e+01
1716.lowfreq: -28.6799 -26.0176 -18.6262 -0.0011 -0.0011 0.0005 67.9953 80.2837 94.8714
frequency: 67.7969 80.2362 94.4322 123.5443 155.7813 174.5658 193.8533 212.2446 215.7473 232.6855 244.6566 283.4890 300.4487 310.3689 362.9058 374.5831 400.6089 420.2872 466.7077 497.1890 538.5552 564.2032 619.8367 651.4989 848.4264 866.1429 908.0211 913.7429 918.7111 935.6940 946.0317 962.7238 976.2701 996.6359 1040.2957 1108.9941 1113.8008 1134.2121 1158.1784 1176.3538 1182.0659 1205.4450 1295.4468 1302.4916 1304.4933 1314.4412 1356.3239 1372.9792 1375.5146 1378.6954 1391.8491 1399.5137 1440.7905 1452.5988 1463.9470 1469.4441 1473.1552 1477.2504 1482.0707 1485.6862 1492.1004 1494.8284 1590.8200 2974.1393 2975.1932 2979.2638 2986.1455 2986.7314 2988.9058 2997.7922 3062.4814 3065.9036 3072.6789 3074.6982 3078.8522 3085.6126 3087.0459 3092.5366 3096.0069 3120.8704 3372.4873
redmass: 1.8048 4.7954 1.6773 1.8161 2.9579 2.5704 1.1041 1.3604 1.1909 1.1365 1.7584 3.9305 2.6682 2.3123 3.0366 3.3883 3.3289 2.5560 2.8792 1.6216 1.7303 3.1790 2.3799 3.3425 2.8591 2.3121 1.4838 1.7003 1.1780 2.4001 1.4783 1.5047 1.7722 1.9487 2.3692 2.0413 2.0003 2.3791 2.2695 1.9451 2.1519 3.1093 1.4014 1.3597 1.4020 1.3552 1.4372 1.2169 1.2346 1.2216 1.2017 1.2082 1.0768 1.0613 1.0457 1.0514 1.0537 1.0478 1.0503 1.0502 1.0481 1.0552 7.3488 1.0381 1.0563 1.0561 1.0381 1.0394 1.0393 1.0823 1.0981 1.0988 1.0976 1.0985 1.0922 1.0999 1.0989 1.0988 1.0995 1.1019 1.0640
irintensity: 0.0506 0.2612 0.4316 0.3450 0.4323 0.6200 0.5104 1.2041 0.4346 0.6762 2.0872 10.4948 3.0722 3.3663 11.5483 3.8258 5.6329 0.1512 15.9039 42.3380 39.1379 4.0011 9.9641 5.6018 1.0242 6.4880 0.4813 5.7478 5.1103 35.6394 7.6735 1.6408 11.2462 36.6826 2.2517 28.4313 0.4408 12.1663 8.5697 10.4618 9.4788 79.1788 34.3584 1.2960 13.2577 6.4966 55.0087 12.4018 41.6700 32.6759 40.3550 14.1411 16.0244 15.6363 4.3788 0.9478 4.5590 9.6009 13.0645 10.5685 15.7254 8.2717 88.1414 29.7919 25.9019 29.4038 13.1577 31.1290 13.5783 12.7446 15.4427 29.7314 58.5414 68.3947 4.8320 15.1482 36.1502 20.5936 26.8949 8.4694 58.2515
temp: 298.150 k
press: 1.00000 atm
elementType: 8 8 6 6 6 6 6 6 6 6 6 1 1 1 1 1 1 1 1 1 1 1 1 1 1 1 1 1 1
symmnumber: 1
zpe: 663268.0 jmol-1
zpe.correction: 0.252625 hartree
zpe.thermalcorrener: 0.266859 hartree
zpe.thermalcorrenthalpy: 0.267803 hartree
zpe.thermalcorrgfe: 0.213420 hartree
zpe.sumelectzpe: -503.284453 hartree
zpe.sumelectthermal: -503.270220 hartree
zpe.sumelectthermalent: -503.269276 hartree
zpe.sumelectthermalfe: -503.323658 hartree
dipole: 0.4467 -1.1072 3.0838
dipole: 3.3069
quadrupole: -68.2627 -73.5027 -70.6988
quadrupole: -1.7978 0.1868 2.2838
quadrupole: 2.5587 -2.6813 0.1226 -1.7978 0.1868 2.2838
hfenergy: -503.5370788 hartree
pointgroup: C01 [X(C9H18O2)]
dipole: -0.0454214 0.13339 1.2933622 debye
polarizability: 104.5636915|1.9164534|104.7724449|-1.3627233|3.670036|98.540374 unknown
InChI: InChI=1S/C9H18O2/c1-6(2)9(11,7(3)4)8(5)10/h6-7,11H,1-5H3
charge 0 multiplicity 1
29 atoms
O  0.358117 0.361371 -1.768961
O  -0.583836 -1.992259 -1.191202
C  0.187107 0.137724 -0.327325
C  1.601043 0.274041 0.351474
C  -0.860691 1.215016 0.15677
C  -0.351654 -1.308691 -0.149943
C  2.565029 -0.825873 -0.155641
C  2.208292 1.671164 0.084187
C  -2.261755 0.942301 -0.441433
C  -0.94245 1.449516 1.683614
C  -0.604133 -1.893096 1.225278
H  1.469896 0.148052 1.445602
H  -0.486976 2.148443 -0.308282
H  3.559077 -0.709806 0.31288
H  2.687547 -0.74511 -1.250208
H  2.204719 -1.84675 0.073426
H  3.234939 1.721291 0.491563
H  1.623607 2.484276 0.549875
H  2.252893 1.856673 -1.002838
H  -2.741316 0.052258 0.010724
H  -2.194914 0.785099 -1.531425
H  -2.92907 1.804304 -0.259298
H  -1.644767 2.279664 1.884888
H  -1.321285 0.566872 2.229396
H  0.032488 1.729313 2.119168
H  0.073191 -0.487174 -2.219417
H  -0.594829 -2.99312 1.163965
H  -1.60824 -1.582796 1.574056
H  0.126571 -1.544704 1.97301
