program: Gaussian 09
title: 000251186
version: EM64L-G09RevD.01
frameworkgroup: C1[X(C9H18O2)]
method: RPBEPBE
basis: SDD
operation: Freq
keyword: #pfreq=noraman
keyword: PBEPBE/SDD
title: #p freq=noraman PBEPBE/SDD
converged: YES YES NO NO
title: Mulliken charges:
elementType: O O C C C C C C C C C H H H H H H H H H H H H H H H H H H
charge: -0.279417 -0.270517 0.385289 -0.459403 -0.011125 -0.380723 -0.732069 -0.320830 -0.323536 -0.716059 -0.698938 0.219104 0.191564 0.178412 0.226192 0.201436 0.235045 0.236981 0.209163 0.187127 0.227806 0.228098 0.182078 0.255337 0.196253 0.197069 0.224184 0.191230 0.220247
chargesum: 0.00000
title: Mulliken charges with hydrogens summed into heavy atoms:
elementType: O O C C C C C C C C C
charge: -0.279417 -0.270517 0.385289 -0.048735 0.167287 0.046905 -0.050879 0.094103 0.086639 -0.067400 -0.063276
polarizability: 1.11637583e+02 2.88930360e+00 9.97996758e+01 8.86859804e-02 4.71074556e-02 9.38866407e+01
1716.lowfreq: -20.3546 -4.1584 -0.0010 -0.0010 -0.0007 9.9645 48.0541 95.5569 120.7314
frequency: 47.9683 95.5286 120.7023 168.4968 194.5152 211.4479 228.8273 241.9421 265.7631 278.6645 343.3690 349.2707 370.6228 398.4968 438.3686 455.4019 458.9115 570.6718 639.5143 675.8182 728.1346 782.7614 847.3952 871.8569 889.7444 898.4296 918.4443 920.1778 930.6647 962.9171 985.9861 1034.1400 1040.8698 1056.3063 1067.5309 1118.7610 1137.5788 1152.8836 1193.8353 1197.9083 1217.7578 1235.9792 1268.8136 1271.5764 1312.4278 1334.1919 1344.6905 1347.9671 1357.3098 1369.5705 1370.5678 1375.0668 1390.4030 1439.0185 1441.7538 1457.3066 1458.1995 1459.0438 1471.9595 1477.1001 1483.5020 1487.6336 1492.4837 2937.0509 2952.8266 2959.0770 2971.6483 2978.8767 2986.8124 2995.6946 2997.8208 3040.0011 3055.8090 3063.4967 3072.1985 3075.8022 3081.7680 3093.5388 3095.0759 3099.8016 3104.6134
redmass: 2.9300 2.9049 2.6939 1.1741 3.1101 1.0996 1.8953 1.1998 2.7214 2.5812 1.9721 1.9461 2.2168 2.5700 2.9640 3.0887 3.8140 2.3779 2.4261 5.3751 3.1846 2.9822 2.9967 1.8121 1.7410 2.0148 1.9102 1.2988 2.1110 1.5144 1.9560 2.3848 1.8575 2.2330 2.2701 1.9456 2.2782 2.3492 1.2013 2.0140 1.3502 2.1613 1.3418 1.1494 1.6403 1.4330 1.4165 1.2291 1.2911 1.3475 1.2357 1.2305 1.2291 1.0931 1.0811 1.0470 1.0678 1.0668 1.0516 1.0517 1.0627 1.0782 1.0557 1.0812 1.0678 1.0672 1.0378 1.0391 1.0576 1.0595 1.0382 1.1007 1.0989 1.0983 1.0983 1.0951 1.0994 1.0992 1.0989 1.1003 1.0973
irintensity: 0.1654 1.6152 1.5088 0.6355 4.4293 0.1300 0.8727 0.0405 5.5296 0.7067 2.8568 2.6014 2.1173 0.3160 7.7610 2.1185 2.5151 5.4398 5.7178 3.9944 33.6036 3.4321 12.1658 22.3375 1.1371 6.0337 6.3426 4.3159 17.7042 0.1801 20.8276 37.0386 36.5416 31.5948 68.7582 2.8126 30.5466 35.6541 0.4803 20.6172 15.8560 53.5848 1.3131 4.5389 20.0169 1.5271 3.6364 0.4248 12.5408 22.0962 20.5891 12.6736 12.5427 11.6940 7.3558 4.2424 2.9922 9.1013 10.0346 5.0130 0.4556 9.6057 16.3628 39.4935 57.8720 73.1595 49.1422 53.9197 26.7230 37.3185 23.8342 14.7997 48.5102 42.8210 49.4604 39.0765 38.6461 26.5536 35.2433 18.8552 34.6485
temp: 298.150 k
press: 1.00000 atm
elementType: 8 8 6 6 6 6 6 6 6 6 6 1 1 1 1 1 1 1 1 1 1 1 1 1 1 1 1 1 1
symmnumber: 1
zpe: 674196.6 jmol-1
zpe.correction: 0.256788 hartree
zpe.thermalcorrener: 0.269224 hartree
zpe.thermalcorrenthalpy: 0.270168 hartree
zpe.thermalcorrgfe: 0.219315 hartree
zpe.sumelectzpe: -503.264073 hartree
zpe.sumelectthermal: -503.251637 hartree
zpe.sumelectthermalent: -503.250693 hartree
zpe.sumelectthermalfe: -503.301545 hartree
dipole: -2.4853 0.3381 0.4461
dipole: 2.5476
quadrupole: -63.2979 -66.6701 -72.1140
quadrupole: 2.5570 -2.3344 -0.8639
quadrupole: 4.0627 0.6906 -4.7533 2.5570 -2.3344 -0.8639
hfenergy: -503.5208607 hartree
pointgroup: C01 [X(C9H18O2)]
dipole: -0.994419 0.1162819 0.0467586 debye
polarizability: 111.0824828|2.003278|99.1382078|3.6511331|1.914745|95.1032093 unknown
InChI: InChI=1S/C9H18O2/c1-8(2)7-9(3)10-5-4-6-11-9/h8H,4-7H2,1-3H3
charge 0 multiplicity 1
29 atoms
O  -0.48537 -0.274782 0.991609
O  -0.609839 0.348017 -1.360301
C  -0.246876 0.798503 0.007875
C  1.268139 1.096701 -0.038799
C  2.301391 -0.069131 0.005807
C  -2.192335 -1.339723 -0.453227
C  -1.039733 2.073681 0.382418
C  -1.859527 -0.819372 0.956888
C  -1.974361 -0.204793 -1.472075
C  2.517677 -0.626175 1.435483
C  2.014564 -1.209588 -0.998978
H  1.41264 1.666715 -0.977409
H  1.49775 1.788896 0.795279
H  3.261243 0.402168 -0.302832
H  -1.528601 -2.188474 -0.697776
H  -3.240816 -1.694849 -0.494327
H  -0.825741 2.344683 1.430598
H  -0.724067 2.904855 -0.271414
H  -2.130587 1.952519 0.272414
H  -2.593399 -0.047143 1.27349
H  -1.858088 -1.626375 1.707357
H  -2.043351 -0.565338 -2.511318
H  -2.733484 0.594788 -1.329396
H  1.592385 -1.091503 1.811693
H  2.808054 0.177943 2.139047
H  3.324606 -1.38392 1.435715
H  1.116565 -1.775546 -0.698013
H  2.872176 -1.908834 -1.033455
H  1.835288 -0.817723 -2.015551
