program: Gaussian 09
title: 000251185
version: EM64L-G09RevD.01
frameworkgroup: C1[X(C9H17NO4)]
method: RPBEPBE
basis: SDD
operation: Freq
keyword: #p
keyword: freq=noraman
keyword: PBEPBE/SDD
title: #p freq=noraman PBEPBE/SDD
converged: YES YES NO NO
title: Mulliken charges:
elementType: O O O O N C C C C C C C C C H H H H H H H H H H H H H H H H H
charge: -0.273071 -0.200611 -0.219552 -0.239149 0.106572 -0.092066 -0.058959 -0.541332 -0.402962 -0.720636 -0.699719 0.258042 -0.265007 -0.662190 0.248615 0.260883 0.253545 0.239855 0.230428 0.241545 0.258065 0.229991 0.213277 0.236003 0.216196 0.223069 0.238613 0.226182 0.223252 0.224513 0.246609
chargesum: 0.00000
title: Mulliken charges with hydrogens summed into heavy atoms:
elementType: O O O O N C C C C C C C C C
charge: -0.273071 -0.200611 -0.219552 -0.239149 0.106572 0.156549 0.201924 -0.047933 0.069010 -0.019304 -0.024450 0.258042 0.199788 0.032184
polarizability: 1.26522991e+02 7.74846298e+00 1.15582012e+02 1.96859450e+00 1.14589663e+00 1.08375628e+02
1716.lowfreq: -13.6614 -8.6449 -0.0004 0.0003 0.0004 4.6732 12.8835 33.0533 47.6266
frequency: -7.5497 32.8047 47.5684 53.1133 68.8627 87.1014 109.3766 150.9852 171.3747 174.2865 196.3431 211.0208 222.6535 273.9964 279.1325 316.1599 335.8701 380.9521 412.7010 436.8244 471.1652 489.6338 584.4434 639.7775 664.9718 713.6051 766.8854 782.0035 808.2373 833.9115 846.5589 881.8346 906.9022 919.8715 969.1583 1012.6856 1032.6873 1052.5426 1068.9598 1084.9993 1095.3554 1113.4325 1150.7890 1155.3671 1165.1909 1209.8217 1227.1196 1248.3322 1261.6520 1277.5427 1284.7101 1303.3554 1339.8233 1342.5758 1345.1025 1358.7606 1389.0976 1398.5519 1404.5419 1427.3207 1455.1913 1456.7446 1463.6292 1465.4370 1475.8935 1477.9932 1482.2034 1485.2306 1486.2101 1637.6795 2983.7415 2992.0193 2992.1152 3000.3458 3000.5785 3020.1190 3031.7280 3040.6735 3060.1246 3082.3404 3083.7773 3086.9399 3088.6751 3092.1092 3097.0750 3100.4881 3119.5602
redmass: 4.4223 3.4100 4.8247 10.0071 3.0953 2.6933 3.2369 3.0429 3.8590 3.7777 1.2905 1.1789 1.3378 2.3036 2.4522 2.6194 3.4630 4.0101 2.8997 3.1770 3.3719 2.9661 4.0272 3.3477 6.1558 3.3447 3.0351 2.2865 1.4893 2.3793 2.1660 2.1759 2.6285 1.7603 1.6915 2.7517 2.0716 2.5080 1.7726 1.7520 2.1239 2.1429 2.3882 1.9133 2.7304 1.8735 1.7482 1.4005 1.6884 1.1196 1.5579 1.2001 1.4506 1.4588 1.3163 1.3754 1.2319 1.2059 1.2132 3.2648 1.0940 1.1105 1.0629 1.0583 1.0568 1.0729 1.0483 1.0489 1.0465 8.7578 1.0364 1.0358 1.0365 1.0700 1.0719 1.0652 1.0595 1.0868 1.0996 1.0999 1.0989 1.0979 1.1008 1.1023 1.0987 1.1003 1.1068
irintensity: 0.9040 0.3199 1.3679 0.0521 1.5301 0.6812 2.4829 3.7516 0.4321 3.2038 0.1393 0.9371 3.4710 2.1955 2.6177 8.4510 2.1081 2.9291 3.4281 6.0670 0.6532 4.7042 4.4427 3.4351 0.4234 12.6065 32.9472 3.8973 2.6146 1.2145 2.2120 9.9322 10.3977 3.7398 1.6327 44.0313 3.6316 124.7418 13.4501 20.3782 10.7429 6.0856 82.9520 79.1779 22.1785 43.0553 16.6603 39.6179 14.9734 4.9639 22.5101 15.2977 7.6207 2.1455 15.6431 8.5205 18.9100 10.9220 19.7109 100.9517 13.8486 8.6284 10.6126 11.3271 9.5648 25.9759 0.7616 38.2630 5.5394 138.5045 22.3530 19.8521 14.7516 5.0087 9.6587 12.1142 31.4166 6.7133 0.2250 45.7320 25.0994 49.3423 15.7298 3.8114 12.2763 13.6142 29.2572
temp: 298.150 k
press: 1.00000 atm
elementType: 8 8 8 8 7 6 6 6 6 6 6 6 6 6 1 1 1 1 1 1 1 1 1 1 1 1 1 1 1 1 1
symmnumber: 1
zpe: 674388.9 jmol-1
zpe.correction: 0.256861 hartree
zpe.thermalcorrener: 0.272651 hartree
zpe.thermalcorrenthalpy: 0.273596 hartree
zpe.thermalcorrgfe: 0.212761 hartree
zpe.sumelectzpe: -707.599691 hartree
zpe.sumelectthermal: -707.583901 hartree
zpe.sumelectthermalent: -707.582957 hartree
zpe.sumelectthermalfe: -707.643792 hartree
dipole: 4.2149 1.0218 -2.5468
dipole: 5.0295
quadrupole: -94.0640 -81.1728 -88.9141
quadrupole: 6.5983 3.2064 3.0077
quadrupole: -6.0137 6.8775 -0.8638 6.5983 3.2064 3.0077
hfenergy: -707.8565524 hartree
pointgroup: C01 [X(C9H17N1O4)]
dipole: -1.6755262 -0.4218615 -0.9644317 debye
polarizability: 125.6419901|8.2834543|116.4416741|-2.10761|-1.0974814|108.3969677 unknown
InChI: InChI=1S/C9H17NO4/c1-4-8(10(12)13)7(3)6-9(11)14-5-2/h7-8H,4-6H2,1-3H3
charge 0 multiplicity 1
31 atoms
O  -2.492355 -0.215334 -0.707501
O  2.789985 -0.598191 1.543091
O  3.42697 0.09059 -0.534104
O  -2.019143 1.290598 1.011686
N  2.5348 -0.232265 0.337192
C  0.734157 1.264391 -0.556848
C  1.061878 -0.19198 -0.112501
C  -0.726142 1.366369 -1.10373
C  0.872989 -1.270658 -1.205604
C  0.995486 2.284024 0.576966
C  1.255632 -2.692193 -0.740937
C  -1.784238 0.851565 -0.138364
C  -3.567525 -0.834123 0.134118
C  -2.987843 -1.927256 1.035855
H  1.404897 1.498729 -1.407252
H  0.501327 -0.456346 0.802719
H  -0.829062 0.834286 -2.062266
H  -0.934527 2.437269 -1.285678
H  1.468653 -0.982957 -2.092749
H  -0.192349 -1.258145 -1.497261
H  0.342456 2.09365 1.445601
H  2.047811 2.255793 0.9101
H  0.787853 3.308727 0.219399
H  2.332201 -2.77441 -0.507985
H  0.690793 -2.983767 0.164169
H  1.029114 -3.427063 -1.533613
H  -4.048261 -0.036659 0.727252
H  -4.273999 -1.238316 -0.608062
H  -3.807691 -2.43966 1.572383
H  -2.443108 -2.682171 0.442113
H  -2.305358 -1.496899 1.788116
