program: Gaussian 09
title: 000251182
version: EM64L-G09RevD.01
frameworkgroup: C1[X(C7H14O3)]
method: RPBEPBE
basis: SDD
operation: Freq
keyword: #pfreq=noraman
keyword: PBEPBE/SDD
title: #p freq=noraman PBEPBE/SDD
converged: YES YES NO NO
title: Mulliken charges:
elementType: O O O C C C C C C C H H H H H H H H H H H H H H
charge: -0.307748 -0.261117 -0.442549 -0.404365 -0.012780 -0.426621 -0.410554 0.051014 -0.350751 -0.504901 0.202956 0.208397 0.206704 0.226686 0.198530 0.226586 0.218813 0.165022 0.194753 0.206627 0.350807 0.233838 0.230856 0.199800
chargesum: 0.00000
title: Mulliken charges with hydrogens summed into heavy atoms:
elementType: O O O C C C C C C C
charge: -0.307748 -0.261117 -0.091742 0.006987 0.193924 -0.001405 0.034844 0.216036 0.050629 0.159593
polarizability: 9.56648312e+01 -4.22629098e+00 9.02825562e+01 -5.55878300e-02 -9.77795199e-02 6.76968887e+01
1716.lowfreq: -6.6767 -0.0011 -0.0009 -0.0003 5.9143 11.7664 78.4215 90.5355 128.4169
frequency: 78.2588 90.5154 128.4112 137.1417 160.3870 188.6437 240.5900 273.3654 363.7864 377.6356 430.3801 455.9223 475.4148 494.4125 515.2093 544.5440 787.1578 832.6245 853.5754 876.9889 904.5432 933.5521 959.2431 979.8641 994.2466 1070.0548 1071.4832 1095.6348 1105.9273 1113.2082 1128.3162 1150.3795 1178.4617 1192.9688 1199.0867 1248.8282 1276.9402 1293.8253 1308.3179 1320.7026 1337.8577 1346.8363 1357.8100 1371.2723 1387.6402 1432.9983 1447.2611 1454.8443 1455.3881 1463.3407 1472.9021 1478.4588 2856.3584 2930.5197 2954.0817 2961.9609 2975.3895 2985.1419 3010.0814 3043.1721 3052.4983 3056.8853 3076.5157 3078.3140 3119.4729 3527.1253
redmass: 2.9676 3.1155 2.8562 2.9162 1.5864 1.9668 2.6224 2.0431 4.2100 4.3198 2.2583 1.8856 2.1320 2.6565 3.0636 1.9283 2.6747 2.1625 2.0389 2.7874 2.1989 4.7492 1.6931 3.1312 3.2205 2.6447 2.8051 1.8115 1.7345 1.3696 2.5456 1.5184 1.5843 1.3322 1.4472 1.2695 1.3015 1.1812 1.2643 1.2056 1.4080 1.4249 1.2870 1.5140 1.3043 1.1727 1.0959 1.0903 1.0523 1.0857 1.0899 1.0540 1.0828 1.0825 1.0372 1.0681 1.0643 1.0606 1.0610 1.0976 1.1010 1.0963 1.0970 1.1026 1.1017 1.0649
irintensity: 6.2041 4.2517 4.6178 1.7639 1.0640 6.1691 0.9905 3.4960 2.7019 2.2103 27.6562 46.7503 70.1408 29.6271 20.5228 4.6963 14.3256 23.1047 39.2373 19.8477 83.2833 43.0774 10.6580 60.5985 116.1992 64.7548 32.9354 5.5976 8.0902 6.3432 29.5480 19.9314 9.3248 33.5830 16.2452 0.9765 3.2205 19.8105 2.0488 23.5188 2.1366 8.5334 2.8728 39.0277 25.8057 10.9260 3.8242 9.8738 10.5863 8.1944 15.8141 11.5493 74.6698 26.6593 62.7333 70.8120 39.7884 40.3172 19.6509 29.0807 48.6618 46.8136 35.0853 48.4969 28.7515 9.6737
temp: 298.150 k
press: 1.00000 atm
elementType: 8 8 8 6 6 6 6 6 6 6 1 1 1 1 1 1 1 1 1 1 1 1 1 1
symmnumber: 1
zpe: 541098.9 jmol-1
zpe.correction: 0.206094 hartree
zpe.thermalcorrener: 0.216922 hartree
zpe.thermalcorrenthalpy: 0.217866 hartree
zpe.thermalcorrgfe: 0.169869 hartree
zpe.sumelectzpe: -499.953096 hartree
zpe.sumelectthermal: -499.942267 hartree
zpe.sumelectthermalent: -499.941323 hartree
zpe.sumelectthermalfe: -499.989320 hartree
dipole: 0.7447 2.1902 1.1615
dipole: 2.5886
quadrupole: -65.3580 -60.5911 -61.3054
quadrupole: -10.6094 3.9783 0.7275
quadrupole: -2.9398 1.8270 1.1128 -10.6094 3.9783 0.7275
hfenergy: -500.1591893 hartree
pointgroup: C01 [X(C7H14O3)]
dipole: 0.3702714 0.8232711 0.4714964 debye
dipolederiv: -1.3111465 0.1493885 -0.039028 -0.0807698 -0.5850582 0.0069643 -0.1213019 0.0119537 -0.4158783 -0.7860232 0.353475 -0.0471824 0.3885699 -0.9463492 0.0118821 0.0385242 -0.0672142 -0.4069182 -0.3200226 -0.0661377 -0.1365786 -0.141442 -0.8300233 0.0194203 -0.1522616 -0.0066871 -0.5157508 -0.0466687 -0.0890571 -0.0342137 -0.0017891 -0.0726448 0.0147207 0.001453 0.001764 0.1113185 0.5566178 -0.1610679 -0.0774271 -0.2278501 0.30465 -0.0120439 -0.2235025 -0.0251749 0.3150279 0.0764039 -0.0123313 0.0020881 -0.0011579 0.0481375 -0.0100249 -0.0002439 0.047881 0.1666806 -0.0447771 0.0500981 0.0124786 0.0215587 -0.1451964 0.0170482 -0.0155469 0.0298612 0.082696 1.3882288 -0.3944978 0.0774082 -0.0307349 0.7582794 0.0166591 0.1644064 0.0884229 0.6189666 0.2469675 0.0125442 0.0300357 -0.0161329 0.545146 -0.0980991 0.0569239 -0.0523505 0.3890605 0.2684427 -0.0290217 0.0413789 -0.1834025 0.6065992 -0.0396324 0.1283601 -0.1220087 0.3256041 -0.1235517 0.1080802 0.054424 0.1106035 0.007265 -0.0256369 0.0771687 -0.0459552 0.0577379 0.0699804 -0.0232673 -0.0054831 -0.0269185 0.0522346 -0.0205549 -0.0455364 0.0324024 -0.1546664 -0.0191717 0.0186625 -0.0501471 0.0557198 0.01153 0.0132661 0.054175 -0.0016222 -0.2067509 0.0377144 -0.025168 0.0020522 -0.0232287 -0.1972174 0.0543516 0.0075734 0.0841969 0.0642915 0.0167252 0.0082515 0.0073586 0.0041025 0.0866073 0.0204374 0.0010305 -0.0596222 -0.1897273 0.0896527 0.0154115 -0.0017737 0.0226218 0.0614857 -0.0120709 0.0426969 0.0132464 -0.1199088 -0.1240111 -0.0721083 -0.0629964 -0.0812601 0.0422803 -0.0263342 -0.083019 -0.0339503 0.0588637 -0.0855063 0.0413012 0.0421175 -0.0282307 -0.0229852 0.0406776 -0.0220428 -0.0254537 -0.2607392 0.0689964 -0.0187595 0.0347091 -0.0092299 -0.0313952 0.0638438 -0.0442609 0.0750369 -0.2022185 -0.0988018 0.0866407 0.0416357 0.0670023 0.0109164 -0.0126341 0.0851912 -0.0335652 0.0571136 0.1534867 0.1073838 0.0910395 0.1188604 0.3553125 0.0347852 0.1048186 0.0434669 0.3027408 -0.0931595 0.1224144 0.0608953 0.0873225 0.0168121 -0.0122542 0.0700976 -0.0239768 0.0905138 -0.0187847 -0.1582288 -0.0764272 -0.0509768 -0.0631912 -0.0215515 -0.0890407 -0.0212858 0.0398868 0.0984084 -0.0240062 0.0336358 0.0267626 -0.013195 -0.0232195 -0.0356631 0.0906347 -0.2079439 unknown
polarizability: 94.5930999|-4.7177425|91.3123264|1.0597131|-0.3236901|67.7388498 unknown
InChI: InChI=1S/C7H14O3/c1-9-7-4-2-3-6(5-8)10-7/h6-8H,2-5H2,1H3
charge 0 multiplicity 1
24 atoms
O  -0.143426 -0.519336 -0.279507
O  2.21046 -0.731566 -0.236596
O  -2.499533 -1.943301 0.051247
C  -1.247903 1.700679 -0.215562
C  -1.331196 0.22693 0.219624
C  0.075697 2.336294 0.276887
C  1.295715 1.491822 -0.166079
C  1.119773 0.036078 0.273734
C  -2.529449 -0.537097 -0.35538
C  2.224338 -2.130816 0.217043
H  -2.117426 2.255808 0.18722
H  -1.299334 1.750603 -1.321014
H  -1.346524 0.155599 1.331668
H  0.172522 3.368108 -0.107085
H  0.057329 2.408249 1.384138
H  1.395133 1.498193 -1.267065
H  2.23259 1.890248 0.263652
H  1.052654 -0.05042 1.389626
H  -2.523907 -0.441527 -1.462462
H  -3.474233 -0.126361 0.038846
H  -1.576683 -2.26068 -0.135399
H  3.178423 -2.549051 -0.13779
H  1.379485 -2.694783 -0.216439
H  2.178697 -2.189575 1.324593
