program: Gaussian 09
title: 000251170
version: EM64L-G09RevD.01
frameworkgroup: C1[X(C16H32O3)]
method: RPBEPBE
basis: SDD
operation: Freq
keyword: #pfreq=noraman
keyword: PBEPBE/SDD
title: #p freq=noraman PBEPBE/SDD
converged: YES YES NO NO
title: Mulliken charges:
elementType: O O O C C C C C C C C C C C C C C C C H H H H H H H H H H H H H H H H H H H H H H H H H H H H H H H H
charge: -0.256627 -0.452643 -0.250926 -0.386246 -0.386070 -0.385915 -0.385470 -0.384443 -0.383081 -0.381131 -0.375742 -0.380857 -0.377725 -0.393771 -0.365361 -0.282280 -0.342446 0.285909 -0.751793 0.194189 0.194372 0.193481 0.193660 0.193952 0.194249 0.194128 0.194235 0.194695 0.194416 0.192479 0.192373 0.195498 0.195980 0.194925 0.194883 0.195449 0.195625 0.189100 0.188953 0.212495 0.212438 0.213714 0.213623 0.228222 0.227441 0.186942 0.186941 0.340170 0.246791 0.244488 0.246715
chargesum: 0.00000
title: Mulliken charges with hydrogens summed into heavy atoms:
elementType: O O O C C C C C C C C C C C C C C C C
charge: -0.256627 -0.112474 -0.250926 0.002314 0.001071 0.002287 0.002893 0.004669 0.001770 0.010346 0.014066 0.010217 0.000328 0.031163 0.061976 0.173383 0.031436 0.285909 -0.013800
polarizability: 2.62005373e+02 5.91477821e-02 1.62241413e+02 -8.44851228e-02 5.76368338e-02 1.40777452e+02
1716.lowfreq: -30.2348 -2.4417 -0.0022 0.0012 0.0014 5.4154 12.4114 14.8531 19.5602
frequency: -29.6851 12.6343 14.8570 25.4395 39.8226 42.2430 45.3854 65.5718 70.8997 81.3123 90.1779 98.8734 115.5896 117.0278 125.4156 130.9964 140.5641 147.7739 160.0373 162.5527 188.2363 190.7701 230.8088 252.3487 271.9571 316.4925 337.8768 388.0340 417.0349 453.1735 472.7152 501.8593 510.2761 566.0608 614.0849 723.0327 724.5461 729.4035 738.8973 753.6026 773.3798 799.1569 832.1278 832.9126 873.6202 918.5621 934.3126 957.8342 963.5633 974.2726 984.3935 998.1866 1003.6204 1004.4808 1018.6242 1032.6689 1035.8420 1041.1426 1051.9010 1061.5808 1074.7958 1080.1710 1082.4247 1083.1220 1086.3431 1112.0457 1149.5005 1150.9037 1188.1478 1191.9596 1207.4699 1207.8307 1211.7487 1229.6014 1231.9428 1250.8413 1251.9760 1268.4042 1272.3506 1278.4898 1278.9434 1285.3745 1288.4699 1293.0660 1294.4859 1297.5184 1301.6336 1302.6343 1313.7298 1332.7556 1347.4519 1355.0945 1356.6416 1358.5764 1360.4467 1371.5113 1382.1304 1413.5771 1453.4531 1454.8775 1460.8392 1460.9982 1463.5262 1463.8367 1466.4940 1468.1918 1469.3738 1471.7279 1475.8394 1480.0617 1484.1411 1487.9316 1491.0712 1492.1425 1648.9165 2925.9365 2950.1475 2950.2494 2951.7182 2952.6711 2953.4715 2955.1760 2957.6706 2961.5931 2965.5726 2967.9434 2973.1716 2983.2469 2985.8407 2989.3089 2990.3613 2992.1958 2993.6069 2999.2060 3000.4369 3007.3916 3007.4664 3017.5104 3027.6847 3036.4807 3043.0007 3047.3611 3059.3902 3074.9580 3095.5323 3142.4435 3564.5172
redmass: 1.0721 4.6539 5.1172 5.0390 2.5217 4.4394 3.8472 1.8166 2.9047 4.5039 1.7671 2.4393 1.9134 5.7808 2.1832 4.2110 2.0618 2.0476 2.0913 2.0336 4.0053 2.7529 5.3007 3.5968 1.0871 3.7811 3.9495 3.3567 3.7837 3.1536 3.6085 3.0275 3.1871 2.9895 4.8730 1.0584 1.0666 1.0780 1.0927 1.1101 1.1332 1.1678 6.1815 1.2079 1.2323 1.2332 5.1740 7.6601 1.2054 4.5855 5.4038 2.8732 2.5440 1.1510 4.4260 3.2795 1.0632 1.6670 3.6380 2.8712 2.6316 2.0492 2.3239 2.1501 2.9348 3.9796 1.3940 1.3986 1.7335 1.1971 3.5446 1.5185 1.2957 1.4000 1.3126 1.3190 1.3006 1.2289 1.2958 1.1078 1.0446 1.0664 1.1149 1.3062 1.1031 1.1049 1.1155 1.1095 1.3352 1.3816 1.4442 1.7240 1.5340 1.6631 1.6179 1.4616 1.3237 1.4407 1.0638 1.0472 1.0737 1.0719 1.0750 1.0650 1.0743 1.0735 1.0768 1.0908 1.0925 1.0934 1.0954 1.0977 1.0985 1.0983 9.1761 1.0544 1.0585 1.0584 1.0588 1.0589 1.0591 1.0592 1.0595 1.0593 1.0589 1.0584 1.1065 1.0960 1.0967 1.0979 1.0598 1.0591 1.0995 1.1015 1.0565 1.0367 1.1033 1.1046 1.1051 1.1049 1.1046 1.1047 1.1048 1.1078 1.0974 1.1010 1.0664
irintensity: 0.6800 0.0865 0.0308 0.0465 0.6318 0.9491 0.6285 5.9288 0.4835 0.0201 0.7593 0.5198 3.3435 0.1790 0.7209 3.4745 0.0588 1.3693 0.7891 0.2040 0.7644 6.6212 4.9128 5.2917 156.6079 0.7712 0.6020 10.6351 8.3954 0.5236 1.2688 3.1936 5.8104 2.6728 4.7327 18.0632 0.0930 8.5353 0.0353 4.3768 0.2574 0.8012 17.6530 0.0568 0.0028 0.0038 33.6109 45.7244 0.0875 12.2548 6.9118 1.8952 152.1169 0.9083 0.4335 2.7710 0.0131 9.5617 12.1616 4.8703 0.8247 0.0083 2.0113 0.0923 13.1271 6.3972 0.2445 1.8078 0.0242 28.4267 388.9085 2.8511 20.9671 0.0286 7.1243 0.1925 19.0975 0.0007 1.5537 0.6828 1.2007 0.1842 0.2250 8.0842 0.4165 0.2345 0.0043 0.0624 0.4858 1.5923 0.6955 0.0028 0.0321 0.1234 0.3222 14.8486 40.8225 6.1309 28.6636 17.9126 0.0006 0.0086 0.0203 0.0040 0.0705 0.3166 0.1923 0.7233 0.5758 1.4855 0.7932 1.8898 15.4071 34.3404 202.9907 61.4658 0.0513 0.1721 0.5748 1.7934 7.1117 0.7980 0.1311 1.1457 10.3575 317.2417 52.6409 0.1240 0.4999 0.3056 16.4600 48.7494 1.4942 0.0440 43.6634 4.8594 1.7480 0.0182 7.1766 0.0248 141.1941 134.3357 133.8186 87.1345 9.5256 11.8851 2.0922
temp: 298.150 k
press: 1.00000 atm
elementType: 8 8 8 6 6 6 6 6 6 6 6 6 6 6 6 6 6 6 6 1 1 1 1 1 1 1 1 1 1 1 1 1 1 1 1 1 1 1 1 1 1 1 1 1 1 1 1 1 1 1 1
symmnumber: 1
zpe: 1192804.6 jmol-1
zpe.correction: 0.454315 hartree
zpe.thermalcorrener: 0.478945 hartree
zpe.thermalcorrenthalpy: 0.479890 hartree
zpe.thermalcorrgfe: 0.394462 hartree
zpe.sumelectzpe: -852.987188 hartree
zpe.sumelectthermal: -852.962558 hartree
zpe.sumelectthermalent: -852.961614 hartree
zpe.sumelectthermalfe: -853.047041 hartree
dipole: -1.4051 -3.5647 0.0017
dipole: 3.8316
quadrupole: -135.0918 -126.3739 -117.4283
quadrupole: 1.5915 -0.7495 0.0690
quadrupole: -8.7938 -0.0759 8.8697 1.5915 -0.7495 0.0690
hfenergy: -853.4415037 hartree
pointgroup: C01 [X(C16H32O3)]
dipole: 0.5549057 1.4002417 -0.0624294 debye
polarizability: 262.0052989|-0.0947919|162.1940268|-0.0983905|-1.0095402|140.8249131 unknown
InChI: InChI=1S/C16H32O3/c1-16(18)19-15-13-11-9-7-5-3-2-4-6-8-10-12-14-17/h17H,2-15H2,1H3
charge 0 multiplicity 1
51 atoms
O  -7.765276 0.507301 -0.020523
O  11.271167 -0.477637 -0.017719
O  -9.181002 -1.341447 0.089712
C  1.116865 -0.384927 0.028551
C  2.406149 0.466744 0.006384
C  -0.176439 0.460812 0.014565
C  3.699054 -0.379657 0.017092
C  -1.465003 -0.391947 0.037089
C  4.988872 0.471244 -0.005903
C  -2.757763 0.45413 0.015521
C  6.280364 -0.377006 0.004369
C  -4.044846 -0.400764 0.041339
C  7.570782 0.473235 -0.020405
C  -5.332645 0.455666 0.004549
C  8.855173 -0.386411 -0.007797
C  -6.58928 -0.413504 0.039995
C  10.131482 0.457856 -0.035749
C  -9.024448 -0.101513 0.011358
C  -10.118591 0.942602 -0.06261
H  1.115813 -1.069946 -0.845154
H  1.121386 -1.032705 0.930219
H  2.400868 1.115835 -0.894414
H  2.408615 1.150439 0.881186
H  -0.180897 1.10779 -0.887701
H  -0.175234 1.146374 0.887841
H  3.696183 -1.06356 -0.857467
H  3.704537 -1.028649 0.917868
H  -1.462417 -1.035521 0.941701
H  -1.463123 -1.080643 -0.833648
H  4.992041 1.154947 0.868926
H  4.983349 1.120148 -0.906866
H  -2.761528 1.09473 -0.890936
H  -2.758992 1.144739 0.884429
H  6.286734 -1.024865 0.905627
H  6.276882 -1.06127 -0.869564
H  -4.037204 -1.097479 -0.822605
H  -4.043972 -1.034173 0.952779
H  7.571606 1.158184 0.853639
H  7.562971 1.119512 -0.923427
H  -5.345051 1.076362 -0.91208
H  -5.346611 1.152209 0.864894
H  8.874683 -1.02465 0.896944
H  8.863839 -1.067176 -0.881136
H  -6.659633 -1.012202 0.967266
H  -6.64335 -1.107045 -0.819923
H  10.151834 1.086142 -0.953764
H  10.160991 1.132021 0.848844
H  12.118533 0.034659 -0.036326
H  -10.029008 1.64837 0.781288
H  -11.10164 0.451358 -0.034263
H  -10.021026 1.529687 -0.992196
