program: Gaussian 09
title: 000251168
version: EM64L-G09RevD.01
frameworkgroup: C1[X(C15H28O)]
method: RPBEPBE
basis: SDD
operation: Freq
keyword: #pfreq=noraman
keyword: PBEPBE/SDD
title: #p freq=noraman PBEPBE/SDD
converged: YES YES NO NO
title: Mulliken charges:
elementType: O C C C C C C C C C C C C C C C H H H H H H H H H H H H H H H H H H H H H H H H H H H H
charge: -0.286401 0.034688 -0.452353 -0.447334 -0.435853 -0.403748 -0.401912 -0.382436 0.071937 -0.414229 -0.430181 -0.453121 -0.395320 -0.395972 -0.384901 -0.266989 0.191461 0.212538 0.185024 0.189055 0.195138 0.184307 0.192500 0.189876 0.195761 0.194554 0.191636 0.197482 0.186693 0.161724 0.220975 0.206129 0.203619 0.201014 0.213244 0.205013 0.200056 0.190087 0.190862 0.202081 0.198353 0.190787 0.174242 0.179912
chargesum: 0.00000
title: Mulliken charges with hydrogens summed into heavy atoms:
elementType: O C C C C C C C C C C C C C C C
charge: -0.286401 0.226149 -0.054791 -0.063141 -0.059046 -0.018110 -0.015722 0.001738 0.233661 0.012874 -0.025547 -0.034864 -0.005176 -0.003029 0.004238 0.087166
polarizability: 2.06187347e+02 -5.21482716e-01 1.44096135e+02 -8.05995887e-02 8.33011546e-03 1.36333014e+02
1716.lowfreq: -3.1513 -0.0013 -0.0008 0.0000 8.4509 12.7660 25.1094 40.7503 46.3008
frequency: 17.8958 38.9116 45.1784 71.5208 72.2125 100.0941 125.7108 158.4615 172.1702 203.0094 222.1089 225.0476 267.7981 317.2964 321.2633 359.3403 380.5361 426.2874 433.2609 437.4790 442.8101 476.1647 483.8695 550.2218 573.4521 744.9973 776.1756 784.8955 785.5575 790.8607 834.5957 840.0094 843.1698 878.0944 890.1372 891.5803 896.7547 908.0203 914.4606 925.6037 959.7837 996.6718 1015.1021 1032.8402 1042.2544 1049.0472 1050.6506 1054.1488 1055.5275 1068.7688 1077.9980 1092.8734 1102.5457 1111.5969 1116.0919 1146.1146 1151.0658 1170.6556 1188.0574 1195.6181 1234.2676 1241.1609 1250.7088 1252.8853 1254.6416 1256.6171 1261.8313 1274.5436 1281.5505 1294.5786 1303.9658 1308.3847 1311.7726 1330.4092 1332.4251 1334.3844 1336.9528 1339.4147 1341.4333 1342.6843 1348.4405 1352.4794 1358.9135 1361.2186 1391.1186 1456.3035 1461.8507 1462.4076 1463.6775 1465.3011 1465.8966 1467.2935 1468.8326 1473.4701 1474.6633 1477.2944 1482.6444 1489.7482 2892.0492 2907.1812 2932.4276 2942.3342 2950.2320 2957.2990 2957.9758 2962.5641 2963.5854 2965.0036 2965.1493 2966.8973 2969.4189 2978.4442 2987.4970 2991.0293 2994.4574 3013.6082 3023.2292 3024.5253 3027.2648 3027.7228 3029.3529 3036.9210 3038.9332 3043.2930 3056.3698 3059.3658
redmass: 3.5558 3.0358 3.6211 2.2656 2.4564 3.1753 3.1519 2.4711 3.4574 3.0049 1.7690 1.8127 3.3855 1.7568 1.9830 3.5128 2.7034 2.2597 3.0183 3.2122 2.2428 1.8072 2.4920 1.9548 2.4920 1.2536 1.7990 1.7603 1.6772 1.7090 1.3353 2.2969 2.2191 1.6311 1.6210 1.4319 1.8751 2.3409 1.8756 1.9463 2.4153 2.8255 1.4935 2.9766 2.1393 1.3717 1.5206 2.5984 1.2795 1.9713 1.3438 1.6618 2.2081 2.5192 2.5984 1.6839 2.1612 1.5653 1.5053 1.5457 1.3291 1.3198 1.2520 1.2858 1.2825 1.2717 1.2456 1.2441 1.1293 1.2136 1.2742 1.2726 1.2533 1.3736 1.4159 1.3800 1.4831 1.5162 1.5309 1.4786 1.5089 1.4476 1.4896 1.5074 1.4815 1.0861 1.0895 1.0881 1.0895 1.0824 1.0872 1.0917 1.0803 1.0866 1.0832 1.0934 1.0954 1.0908 1.0818 1.0574 1.0803 1.0596 1.0623 1.0641 1.0999 1.0620 1.0597 1.0637 1.0671 1.0628 1.0632 1.0610 1.0624 1.0818 1.0781 1.0975 1.0986 1.0969 1.0992 1.0970 1.0960 1.1016 1.1034 1.1030 1.1023 1.1029
irintensity: 0.1587 0.1230 0.1018 1.5225 0.0063 0.0783 1.0706 0.9070 1.3314 1.4639 0.0459 0.4292 1.4627 0.0376 1.6543 0.0990 1.4489 0.5412 0.0951 0.0770 1.3813 2.4403 0.9260 0.9932 9.6012 4.0161 0.5941 1.1705 0.4383 1.0218 1.1586 11.7875 0.4303 2.9624 7.0249 7.6933 5.4392 13.8868 2.2917 2.2559 13.3576 6.3711 1.7369 77.6181 2.5816 2.8183 13.4284 58.3396 24.4836 39.9407 5.0896 6.3531 1.3635 1.5535 0.1967 0.6396 2.7639 1.7900 0.6093 0.3389 0.3848 0.7296 6.6476 1.5182 3.5133 0.7390 1.9499 1.3305 3.9694 1.0803 1.7548 1.2814 0.8915 9.2976 1.9519 3.2797 8.5173 3.1105 0.6094 1.1321 4.5126 4.8083 5.5243 23.9165 1.0798 0.7333 3.1190 3.9533 8.2814 3.9594 3.9863 13.2284 14.4088 10.2199 16.8705 5.3260 3.6885 8.8147 37.6334 60.9689 4.8056 21.3301 30.6377 69.1497 43.1556 28.6113 31.1374 47.2830 26.1702 42.6422 33.6944 32.4687 22.7100 14.8622 28.7284 89.8789 88.8329 38.8469 2.8426 77.3834 71.7987 11.0483 148.1413 68.5808 62.0705 82.3910
temp: 298.150 k
press: 1.00000 atm
elementType: 8 6 6 6 6 6 6 6 6 6 6 6 6 6 6 6 1 1 1 1 1 1 1 1 1 1 1 1 1 1 1 1 1 1 1 1 1 1 1 1 1 1 1 1
symmnumber: 1
zpe: 1057347.6 jmol-1
zpe.correction: 0.402722 hartree
zpe.thermalcorrener: 0.419793 hartree
zpe.thermalcorrenthalpy: 0.420737 hartree
zpe.thermalcorrgfe: 0.356272 hartree
zpe.sumelectzpe: -662.301803 hartree
zpe.sumelectthermal: -662.284733 hartree
zpe.sumelectthermalent: -662.283789 hartree
zpe.sumelectthermalfe: -662.348253 hartree
dipole: -0.3577 -1.3386 -0.1157
dipole: 1.3904
quadrupole: -96.5140 -102.4118 -100.3960
quadrupole: 1.9854 0.1016 0.1240
quadrupole: 3.2599 -2.6379 -0.6220 1.9854 0.1016 0.1240
hfenergy: -662.7045256 hartree
pointgroup: C01 [X(C15H28O1)]
dipole: -0.1335886 0.5252146 0.0743396 debye
polarizability: 206.1868485|-0.3746112|144.0688024|0.4378072|0.439012|136.3608444 unknown
InChI: InChI=1S/C15H28O/c1-3-8-14(9-4-1)10-7-13-16-15-11-5-2-6-12-15/h14-15H,1-13H2
charge 0 multiplicity 1
44 atoms
O  -1.796838 -0.482143 0.112661
C  3.190972 0.090713 0.371521
C  3.522371 -0.804469 -0.852088
C  4.306283 1.150928 0.572517
C  1.805356 0.775333 0.249244
C  4.929045 -1.441617 -0.74568
C  5.713304 0.517332 0.682448
C  6.025355 -0.369218 -0.54666
C  -3.163709 0.046914 0.28458
C  0.607103 -0.20082 0.207073
C  -3.646666 0.855726 -0.941633
C  -4.066432 -1.172115 0.53843
C  -5.125454 1.287369 -0.772581
C  -5.546842 -0.750766 0.703467
C  -6.040395 0.066081 -0.514981
C  -0.738626 0.532799 0.197491
H  3.174917 -0.561372 1.273955
H  2.761935 -1.601088 -0.963272
H  3.470348 -0.18157 -1.771273
H  4.289209 1.852555 -0.289043
H  4.088105 1.753649 1.477304
H  1.677514 1.466886 1.109776
H  1.799157 1.410253 -0.662869
H  4.946805 -2.142438 0.11509
H  5.141317 -2.043706 -1.650958
H  6.480089 1.309529 0.790509
H  5.76399 -0.104443 1.600703
H  7.017063 -0.849247 -0.433144
H  6.078727 0.269758 -1.452847
H  -3.18302 0.712823 1.18212
H  0.65427 -0.840299 -0.694011
H  0.636674 -0.878771 1.082347
H  -3.54155 0.21497 -1.840222
H  -3.007642 1.746567 -1.095635
H  -3.704974 -1.711464 1.433364
H  -3.963088 -1.863299 -0.321741
H  -5.460519 1.839559 -1.671731
H  -5.20833 1.991514 0.082006
H  -5.65613 -0.136529 1.62167
H  -6.178062 -1.648932 0.845353
H  -7.085121 0.397348 -0.356822
H  -6.039815 -0.584461 -1.41388
H  -0.86708 1.133887 1.127702
H  -0.788515 1.229273 -0.668762
