program: Gaussian 09
title: 000251164
version: EM64L-G09RevD.01
frameworkgroup: C1[X(C14H14O)]
method: RPBEPBE
basis: SDD
operation: Freq
keyword: #pfreq=noraman
keyword: PBEPBE/SDD
title: #p freq=noraman PBEPBE/SDD
converged: YES YES NO NO
title: Mulliken charges:
elementType: O C C C C C C C C C C C C C C H H H H H H H H H H H H H H
charge: -0.278813 0.196184 0.345462 0.211632 -0.373460 -0.371047 -0.410803 -0.358612 -0.262976 -0.240317 -0.244331 -0.237359 -0.236762 -0.246471 -0.683850 0.247002 0.242599 0.241716 0.250895 0.226847 0.225093 0.210875 0.205184 0.222532 0.221922 0.226125 0.207065 0.227247 0.236424
chargesum: 0.00000
title: Mulliken charges with hydrogens summed into heavy atoms:
elementType: O C C C C C C C C C C C C C C
charge: -0.278813 0.196184 0.345462 0.211632 -0.126459 -0.128449 -0.169088 -0.107717 -0.036129 -0.015224 0.171728 -0.014828 -0.014840 -0.020346 -0.013115
polarizability: 2.10995026e+02 -1.66947888e+01 1.73225564e+02 -5.73351521e+00 -1.27791250e+01 8.45635520e+01
1716.lowfreq: -7.5008 -5.7775 -0.0008 -0.0003 0.0005 7.5076 47.0555 71.6744 74.5131
frequency: 47.0357 71.6708 74.5080 94.8545 121.5235 159.0186 211.8195 242.4216 272.0758 279.9973 323.8731 359.8673 405.2773 431.4975 492.4687 532.1345 564.4957 587.0288 608.0848 618.9998 701.4659 717.4248 730.1579 754.1131 775.0544 776.9528 826.4181 848.4094 853.6289 903.2935 917.0966 934.8941 971.1164 972.4919 987.7700 990.7791 994.1550 1032.8077 1036.4785 1055.1550 1082.4075 1112.2589 1124.0855 1133.9343 1171.8463 1175.5367 1194.9039 1209.3552 1259.0018 1263.5960 1288.8954 1320.2299 1357.1407 1373.2757 1378.4476 1398.5219 1422.6912 1442.9902 1460.4574 1467.6265 1478.7752 1488.4682 1501.6303 1577.0029 1589.5286 1602.9917 1612.0806 2953.6303 2996.9701 3012.4307 3093.6097 3107.5467 3119.9268 3127.7149 3129.2648 3138.0597 3142.4912 3158.0917 3158.8106 3171.4840 3179.6399
redmass: 3.5498 3.4307 4.3868 3.0838 2.0327 3.6964 3.8801 1.2546 4.5835 4.8577 4.4021 3.7900 2.8484 3.6958 3.4834 3.9036 3.4088 6.1809 6.8227 6.3869 1.7280 5.1466 2.4877 1.4649 2.0104 4.3395 1.1455 1.2472 1.3672 3.3507 1.4157 1.3965 1.3306 1.3801 4.2850 1.4931 5.9117 2.7152 2.0855 2.0880 1.6364 2.2301 1.7723 1.4325 1.0518 1.0716 1.1187 3.3735 1.6437 1.2985 1.8958 1.3686 1.8272 5.1864 2.6907 1.2942 2.3190 2.3821 1.0402 1.8948 1.1423 1.2034 2.2302 5.8535 6.9168 6.3078 6.0769 1.0553 1.0363 1.1074 1.0988 1.1014 1.0845 1.0865 1.0868 1.0907 1.0936 1.0973 1.0962 1.0982 1.0957
irintensity: 0.4233 0.7272 3.0648 1.8546 0.3931 0.2534 0.1420 0.8264 0.2309 0.8087 0.5763 1.9586 0.0563 3.7556 3.1684 2.2323 3.9108 5.5965 6.3902 0.7493 51.8864 6.0906 40.7209 92.1076 24.9731 3.0372 1.7297 0.6338 0.1094 34.0726 2.7371 1.5138 0.2967 0.4406 2.0816 0.6985 7.4768 55.8888 5.7989 17.9006 10.0393 2.4231 45.4047 4.4911 0.1862 9.7343 0.6656 174.4491 18.6382 8.0824 3.0460 0.4124 12.2288 1.3619 8.4887 28.9305 40.4132 3.7154 12.8164 67.4314 16.1828 2.2573 17.4729 4.0521 9.9491 21.9513 6.2993 50.0971 22.6378 34.1705 32.1733 32.4723 3.7865 3.7527 3.4176 20.6395 25.3292 28.0804 43.3647 19.2370 7.5893
temp: 298.150 k
press: 1.00000 atm
elementType: 8 6 6 6 6 6 6 6 6 6 6 6 6 6 6 1 1 1 1 1 1 1 1 1 1 1 1 1 1
symmnumber: 1
zpe: 623587.4 jmol-1
zpe.correction: 0.237512 hartree
zpe.thermalcorrener: 0.250704 hartree
zpe.thermalcorrenthalpy: 0.251648 hartree
zpe.thermalcorrgfe: 0.197224 hartree
zpe.sumelectzpe: -616.038978 hartree
zpe.sumelectthermal: -616.025785 hartree
zpe.sumelectthermalent: -616.024841 hartree
zpe.sumelectthermalfe: -616.079266 hartree
dipole: 1.7448 1.0247 0.1754
dipole: 2.0311
quadrupole: -75.3113 -78.3031 -92.0233
quadrupole: 3.6142 -0.7264 -2.8954
quadrupole: 6.5679 3.5761 -10.1441 3.6142 -0.7264 -2.8954
hfenergy: -616.2764895 hartree
pointgroup: C01 [X(C14H14O1)]
dipole: 0.5296833 -0.5946215 0.0663612 debye
polarizability: 217.1161914|1.4227342|154.7829358|-3.4961404|-32.5144855|96.8850147 unknown
InChI: InChI=1S/C14H14O/c1-2-15-14-11-7-6-10-13(14)12-8-4-3-5-9-12/h3-11H,2H2,1H3
charge 0 multiplicity 1
29 atoms
O  0.662875 -1.633449 0.219956
C  0.432073 0.721819 -0.263573
C  -1.059184 0.63831 -0.220615
C  1.291544 -0.403364 -0.041717
C  1.053677 1.9663 -0.548861
C  2.700339 -0.265279 -0.110761
C  -1.833312 1.386844 -1.152031
C  -1.750988 -0.130334 0.75626
C  2.455817 2.113005 -0.61931
C  3.279945 0.989826 -0.398159
C  1.504704 -2.841057 0.327437
C  -3.243877 1.375074 -1.10668
C  -3.161287 -0.138829 0.804932
C  -3.917164 0.613355 -0.124174
C  0.556868 -4.01997 0.535099
H  0.413479 2.844251 -0.689674
H  3.351566 -1.127771 0.056277
H  -1.324312 1.959062 -1.936344
H  -1.177919 -0.719333 1.476548
H  2.895686 3.09255 -0.832893
H  4.370719 1.08317 -0.443083
H  2.098369 -2.960251 -0.602242
H  2.203828 -2.733125 1.182465
H  -3.815827 1.952396 -1.842072
H  -3.671596 -0.733105 1.571674
H  -5.012315 0.60166 -0.086375
H  1.133456 -4.959984 0.611254
H  -0.028606 -3.892951 1.46163
H  -0.146059 -4.10542 -0.310567
