program: Gaussian 09
title: 000251167
version: EM64L-G09RevD.01
frameworkgroup: C1[X(C14H30O2)]
method: RPBEPBE
basis: SDD
operation: Freq
keyword: #pfreq=noraman
keyword: PBEPBE/SDD
title: #p freq=noraman PBEPBE/SDD
converged: YES YES NO NO
title: Mulliken charges:
elementType: O O C C C C C C C C C C C C C C H H H H H H H H H H H H H H H H H H H H H H H H H H H H H H
charge: -0.473907 -0.455888 0.378828 -0.446110 -0.504225 0.306250 -0.425054 -0.512957 -0.423980 -0.387782 -0.383112 -0.756948 -0.385180 -0.706549 -0.694709 -0.693182 0.237333 0.203747 0.176613 0.217448 0.193234 0.210709 0.227690 0.187576 0.208016 0.228825 0.238927 0.193535 0.216415 0.204487 0.236632 0.214559 0.201054 0.205979 0.202363 0.319446 0.325476 0.214201 0.204626 0.215015 0.218664 0.212951 0.207803 0.215444 0.213359 0.212380
chargesum: 0.00000
title: Mulliken charges with hydrogens summed into heavy atoms:
elementType: O O C C C C C C C C C C C C C C
charge: -0.154461 -0.130412 0.378828 -0.005031 -0.110164 0.306250 -0.021112 -0.097690 0.012861 0.044680 0.037789 -0.104703 0.023161 -0.072706 -0.055291 -0.051999
polarizability: 1.76142618e+02 2.65953566e+00 1.58120914e+02 -4.30056218e+00 2.38060519e+00 1.44357935e+02
1716.lowfreq: -18.7404 -11.5106 -7.9118 -0.0009 -0.0007 -0.0006 15.0764 29.1508 46.2599
frequency: 14.5879 28.7954 46.1245 56.4548 64.9443 75.3306 83.9652 100.7104 127.2691 154.6201 165.2360 179.6585 190.4833 204.5087 216.3049 232.7929 235.1666 244.5995 266.3686 279.0892 302.9598 310.1751 317.2015 328.2476 337.2744 341.2834 373.0587 428.1100 454.5308 470.8420 489.2438 508.8447 591.5333 736.4770 737.0356 738.0774 750.8112 757.7093 789.6856 838.0908 851.5868 858.2635 872.8286 891.5376 899.2547 911.9855 929.1563 948.5834 984.0469 992.9155 1021.4742 1045.6600 1050.3326 1054.3748 1056.3458 1070.5808 1091.1876 1100.2610 1110.8016 1114.2602 1135.3631 1147.7181 1171.9369 1190.3730 1196.8480 1230.3997 1239.4682 1246.3834 1263.6556 1278.8908 1284.3470 1288.4941 1291.1109 1293.1405 1298.8150 1314.9994 1326.6528 1340.9208 1351.1460 1362.8706 1363.6675 1370.4405 1380.6959 1387.6415 1388.1219 1390.1445 1444.7040 1454.7958 1459.2155 1462.0529 1467.5327 1469.9343 1473.0185 1473.7152 1476.1423 1476.4429 1477.2313 1477.4498 1478.0214 1485.1797 1489.0759 1489.5523 2939.7221 2952.8406 2967.3863 2968.1441 2971.1152 2971.4646 2972.8581 2973.6483 2974.3168 2978.2114 2985.5912 2989.7872 3010.3280 3012.0406 3014.0925 3022.0500 3034.2474 3042.4835 3046.3193 3050.8513 3060.7211 3068.1246 3068.8778 3071.1817 3071.3287 3072.4819 3072.9035 3086.3722 3537.3578 3546.1248
redmass: 3.5172 3.5162 2.7490 1.9394 2.5628 2.0560 2.6748 1.6687 3.0824 2.9555 2.8142 2.4089 2.7699 1.3437 1.3959 1.1413 1.1517 1.4674 1.1006 2.8514 2.4014 1.4056 2.0422 2.3231 2.3151 2.6464 3.4425 3.5104 3.0827 2.7814 2.3660 3.0093 2.7391 1.2627 1.2590 1.1325 1.6648 2.2069 2.2736 1.5408 1.5837 1.7913 1.8115 1.6999 1.7496 1.7233 1.7865 1.8169 1.5862 1.5972 2.5068 2.4277 1.9689 2.2850 1.9350 1.8996 2.1807 1.7205 1.7994 2.0839 1.6021 2.3524 2.2105 1.8948 1.6208 1.4755 1.2862 1.2962 1.3812 1.1997 1.2500 1.3438 1.1359 1.3326 1.2586 1.3544 1.6368 1.4989 1.5555 1.5387 1.7337 1.6714 1.2325 1.2119 1.2186 1.2118 1.0784 1.0799 1.0613 1.0810 1.0743 1.0628 1.0646 1.0718 1.0429 1.0435 1.0581 1.0457 1.0499 1.0712 1.0870 1.0859 1.0640 1.0655 1.0550 1.0375 1.0393 1.0371 1.0578 1.0384 1.0592 1.0635 1.0599 1.0606 1.0952 1.0931 1.0948 1.0961 1.0995 1.1006 1.1015 1.1009 1.0972 1.0992 1.1006 1.1008 1.1013 1.0995 1.0995 1.0997 1.0657 1.0656
irintensity: 0.2256 0.3292 0.0204 0.0655 0.1999 0.2432 0.7050 0.1802 1.6000 9.9203 11.8594 4.7797 3.2722 0.2798 0.3163 7.8408 9.7405 1.4074 186.2006 16.4569 1.7012 27.2631 14.2342 25.3225 17.6856 6.9111 8.1118 13.5772 3.1435 5.4928 1.6567 8.6853 3.3044 3.9311 0.5808 17.1136 2.2514 1.4912 6.4817 12.5947 5.5718 9.5188 37.8803 5.3100 17.3053 2.0512 4.7691 4.0806 2.1508 19.6782 18.1108 3.5436 2.0515 3.6981 11.6699 13.9759 0.7871 23.0332 29.0454 15.5326 6.1154 6.3818 25.1990 7.7816 25.7866 8.3147 2.1732 4.6738 33.3492 2.4684 2.7662 18.0156 0.4281 11.0579 6.5173 8.2832 27.7213 17.2246 2.9030 3.0989 11.0686 20.2104 19.9429 17.6339 2.8434 12.2181 0.7557 1.5167 5.0023 8.4943 11.5424 8.3226 7.3628 7.4953 26.3287 1.4904 3.9941 11.3768 1.4032 21.6281 8.7100 8.4692 19.7200 34.3072 20.2107 45.7142 37.8553 57.7776 1.0213 24.8397 8.2015 29.4002 34.0867 60.5744 13.9933 8.1231 10.5375 6.3582 39.8113 2.5228 24.4728 24.5176 44.0637 87.2404 52.9725 61.0876 124.7587 34.3481 55.4939 34.4325 4.3067 6.5821
temp: 298.150 k
press: 1.00000 atm
elementType: 8 8 6 6 6 6 6 6 6 6 6 6 6 6 6 6 1 1 1 1 1 1 1 1 1 1 1 1 1 1 1 1 1 1 1 1 1 1 1 1 1 1 1 1 1 1
symmnumber: 1
zpe: 1088870.4 jmol-1
zpe.correction: 0.414729 hartree
zpe.thermalcorrener: 0.436655 hartree
zpe.thermalcorrenthalpy: 0.437599 hartree
zpe.thermalcorrgfe: 0.362957 hartree
zpe.sumelectzpe: -700.570707 hartree
zpe.sumelectthermal: -700.548780 hartree
zpe.sumelectthermalent: -700.547836 hartree
zpe.sumelectthermalfe: -700.622479 hartree
dipole: 0.7823 2.0105 -1.8482
dipole: 2.8408
quadrupole: -107.6003 -106.7765 -101.4682
quadrupole: -1.3082 -4.8156 4.4534
quadrupole: -2.3186 -1.4948 3.8135 -1.3082 -4.8156 4.4534
hfenergy: -700.9854355 hartree
pointgroup: C01 [X(C14H30O2)]
dipole: -0.3319376 0.7392017 0.7697522 debye
polarizability: 176.3737045|-2.2059162|158.3407143|-3.6696516|-1.5427941|143.9070485 unknown
InChI: InChI=1S/C14H30O2/c1-5-8-13(4,15)11-12-14(16,9-6-2)10-7-3/h15-16H,5-12H2,1-4H3
charge 0 multiplicity 1
46 atoms
O  1.732658 -1.699261 1.117214
O  -2.409714 -2.350389 -0.579572
C  1.446709 -0.473712 0.307866
C  0.013319 -0.573657 -0.2909
C  -1.1281 -0.674901 0.741468
C  -2.51321 -1.042773 0.131324
C  2.482279 -0.542261 -0.841899
C  1.628687 0.762137 1.232878
C  -2.973074 -0.076716 -0.986774
C  3.961346 -0.407907 -0.419867
C  1.463022 2.143348 0.556929
C  -3.568073 -1.171576 1.253332
C  -3.107748 1.408152 -0.582161
C  4.924553 -0.683162 -1.594909
C  1.671602 3.307045 1.550647
C  -3.602418 2.279846 -1.757386
H  -0.025147 -1.470216 -0.93877
H  -0.153478 0.302491 -0.947178
H  -0.880959 -1.461623 1.488393
H  -1.234248 0.272027 1.306214
H  2.234066 0.23161 -1.596276
H  2.342443 -1.522842 -1.338945
H  2.632919 0.700585 1.695394
H  0.902313 0.690525 2.071345
H  -3.947567 -0.446222 -1.36294
H  -2.265186 -0.168549 -1.832252
H  4.157792 -1.118267 0.404571
H  4.155622 0.609271 -0.024225
H  2.186813 2.23787 -0.276329
H  0.453869 2.225375 0.105601
H  -4.538714 -1.480442 0.82703
H  -3.709366 -0.218681 1.79511
H  -3.259076 -1.93268 1.996558
H  -3.812541 1.510301 0.266707
H  -2.131085 1.796513 -0.22866
H  1.226909 -1.636149 1.967694
H  -2.125398 -3.039468 0.07566
H  4.790848 -1.710954 -1.982094
H  4.743947 0.016225 -2.433977
H  5.980548 -0.573615 -1.285887
H  1.555686 4.287839 1.053993
H  2.683441 3.270784 1.996473
H  0.9393 3.258622 2.378835
H  -3.694958 3.341746 -1.464263
H  -4.592812 1.938479 -2.112795
H  -2.904217 2.223935 -2.613781
