program: Gaussian 09
title: 000251142
version: EM64L-G09RevD.01
frameworkgroup: C1[X(C15H15NO2)]
method: RPBEPBE
basis: SDD
operation: Freq
keyword: #p
keyword: freq=noraman
keyword: PBEPBE/SDD
title: #p freq=noraman PBEPBE/SDD
converged: YES YES NO NO
title: Mulliken charges:
elementType: O O N C C C C C C C C C C C C C C C H H H H H H H H H H H H H H H
charge: -0.288919 -0.323703 -0.439329 -0.495964 0.324202 0.440437 0.061708 -0.355488 -0.439149 -0.394716 -0.310078 -0.225070 -0.263446 -0.222294 -0.222569 0.205635 -0.240727 -0.499182 0.228538 0.227066 0.384567 0.243667 0.232268 0.255974 0.268666 0.223322 0.229286 0.226994 0.227717 0.229754 0.241170 0.239289 0.230371
chargesum: 0.00000
title: Mulliken charges with hydrogens summed into heavy atoms:
elementType: O O N C C C C C C C C C C C C C C C
charge: -0.288919 -0.323703 -0.054762 -0.040359 0.324202 0.440437 0.061708 -0.111821 -0.206881 -0.138742 -0.041412 -0.001748 -0.034160 0.004701 0.005148 0.205635 -0.010973 0.211648
polarizability: 2.43563237e+02 1.35783522e+01 1.99765178e+02 -1.39786587e+01 1.09567486e+01 9.87779100e+01
1716.lowfreq: -6.7748 -0.0006 -0.0005 -0.0001 4.3970 6.3324 19.7575 30.3780 48.0829
frequency: 19.7477 30.3405 48.0716 70.6555 100.4871 118.8776 133.8181 147.4895 170.1459 185.4806 225.8493 263.0760 280.6564 334.1424 359.3506 403.5241 421.5343 438.4827 477.8402 523.8477 536.2084 544.1433 615.3414 624.4105 657.7236 677.2929 701.6080 728.7938 747.3171 757.2644 761.8176 774.3154 808.1989 848.6234 854.4252 855.4239 914.3336 923.9716 962.0692 978.9473 982.7782 989.4205 993.5134 1000.6968 1027.3586 1042.8245 1047.5771 1078.7565 1099.8134 1113.0609 1145.6289 1148.0449 1173.1361 1175.2707 1188.5744 1211.8783 1227.6549 1238.6690 1273.7639 1314.2322 1334.1260 1351.8766 1384.3609 1391.9949 1424.6794 1434.7781 1442.7819 1449.7853 1451.3566 1465.1742 1480.1946 1489.9886 1516.6154 1570.9655 1590.0975 1595.8020 1617.5409 1633.2122 2926.4598 2963.0872 3002.1451 3102.6689 3117.6373 3125.7807 3128.2076 3137.4287 3144.5022 3148.5207 3153.7146 3164.7471 3166.3589 3178.9903 3351.2292
redmass: 3.7847 4.5811 5.0428 4.5093 1.4952 2.6131 2.8370 3.9769 4.1149 4.7847 4.3932 3.9248 3.9944 4.4257 5.7376 2.8120 4.7383 3.5709 3.8946 3.0839 4.0906 6.4879 6.3228 5.8359 6.2731 4.4652 1.8876 1.3105 1.5889 1.7113 5.2810 2.0917 4.7901 1.5174 3.2077 1.3638 1.3592 7.5711 1.3647 1.3886 1.3376 3.9696 1.7168 1.5509 2.2034 2.6384 4.0126 2.1260 2.6246 1.2603 1.6931 1.5215 1.0530 1.0770 1.1128 1.7863 1.3470 2.0631 2.0644 1.3972 1.5967 1.8388 7.3142 3.0614 1.5348 1.8461 2.1775 2.6713 1.0513 1.0538 1.4836 1.5480 3.1235 7.1699 2.8605 5.8139 6.1189 6.4799 1.0573 1.1023 1.0295 1.1043 1.0871 1.0863 1.0867 1.0915 1.1046 1.0962 1.0895 1.1016 1.0939 1.0984 1.0803
irintensity: 0.0605 0.1483 0.3228 2.6061 2.2752 0.3304 2.7734 2.9147 1.0454 0.5519 2.8144 5.9456 6.0368 12.8915 11.0226 0.5569 4.3835 0.1963 10.1993 14.7078 23.6377 0.0872 0.2076 3.5548 4.1764 13.2057 64.4534 37.6776 36.5848 139.2367 13.9110 3.7487 3.4112 1.1218 2.4455 0.5891 2.7785 0.9319 1.8143 0.1703 0.1138 0.1734 1.7159 0.7858 12.7233 34.2362 100.9286 54.6085 33.6030 0.0848 3.1965 101.2645 0.0699 3.7429 3.7163 15.0507 6.7802 241.9524 215.5728 14.2795 45.6744 4.7627 0.5700 22.7605 68.0655 19.1601 20.8373 15.5937 13.7587 14.4475 88.2341 11.6949 236.9130 78.1848 173.4678 9.4393 11.5975 270.9366 58.2320 30.9696 46.2864 28.3660 7.7766 0.7894 10.1961 16.9414 19.3239 38.2814 16.7407 22.8017 18.3845 13.0393 101.5855
temp: 298.150 k
press: 1.00000 atm
elementType: 8 8 7 6 6 6 6 6 6 6 6 6 6 6 6 6 6 6 1 1 1 1 1 1 1 1 1 1 1 1 1 1 1
symmnumber: 1
zpe: 693445.9 jmol-1
zpe.correction: 0.264120 hartree
zpe.thermalcorrener: 0.280350 hartree
zpe.thermalcorrenthalpy: 0.281294 hartree
zpe.thermalcorrgfe: 0.218210 hartree
zpe.sumelectzpe: -784.522912 hartree
zpe.sumelectthermal: -784.506682 hartree
zpe.sumelectthermalent: -784.505737 hartree
zpe.sumelectthermalfe: -784.568822 hartree
dipole: 0.5722 -0.2355 0.0521
dipole: 0.6209
quadrupole: -93.6221 -91.2553 -107.4766
quadrupole: -3.9321 -1.8778 3.2178
quadrupole: 3.8293 6.1960 -10.0253 -3.9321 -1.8778 3.2178
hfenergy: -784.7870318 hartree
pointgroup: C01 [X(C15H15N1O2)]
dipole: 0.2212661 0.1035147 0.0019651 debye
polarizability: 243.8017072|-14.5120764|192.7482368|15.5012128|25.9886659|105.5563818 unknown
InChI: InChI=1S/C15H15NO2/c1-18-15(17)13-9-5-6-10-14(13)16-11-12-7-3-2-4-8-12/h2-10,16H,11H2,1H3
charge 0 multiplicity 1
33 atoms
O  -3.172187 -2.252475 -0.270097
O  -0.874206 -2.027839 -0.009518
N  0.109473 0.451069 0.263585
C  1.266774 1.335985 0.432344
C  -1.193454 0.895899 0.1809
C  2.582313 0.587894 0.248707
C  -2.290629 -0.036628 0.005066
C  -1.510535 2.292189 0.265848
C  3.66672 0.833797 1.126163
C  2.759374 -0.329757 -0.818647
C  -3.624056 0.452792 -0.083946
C  -2.836601 2.739064 0.171147
C  -3.909175 1.824444 -0.005911
C  4.907917 0.183606 0.940582
C  3.996326 -0.986854 -1.000951
C  -2.020938 -1.478829 -0.084785
C  5.07629 -0.730743 -0.124124
C  -2.947871 -3.711386 -0.366748
H  1.254146 1.820419 1.432646
H  1.207753 2.157639 -0.314578
H  0.239026 -0.572977 0.254261
H  -0.709178 3.020628 0.417016
H  3.538698 1.532348 1.962429
H  1.928904 -0.530139 -1.50542
H  -4.426866 -0.277678 -0.216633
H  -3.043035 3.813657 0.24076
H  -4.940348 2.183451 -0.076142
H  5.736638 0.383724 1.628998
H  4.117899 -1.696521 -1.827026
H  6.035558 -1.240592 -0.266954
H  -2.464927 -4.089171 0.550171
H  -2.305499 -3.945484 -1.232528
H  -3.952503 -4.139732 -0.491814
