program: Gaussian 09
title: 000251160
version: EM64L-G09RevD.01
frameworkgroup: C1[X(C13H18O)]
method: RPBEPBE
basis: SDD
operation: Freq
keyword: #pfreq=noraman
keyword: PBEPBE/SDD
title: #p freq=noraman PBEPBE/SDD
converged: YES YES NO NO
title: Mulliken charges:
elementType: O C C C C C C C C C C C C C H H H H H H H H H H H H H H H H H H
charge: -0.208828 0.066731 0.352494 0.322875 -0.468252 0.046522 0.487099 -0.361962 -0.580873 -0.616635 -0.819024 -0.837115 -0.691601 -0.814852 0.239099 0.225955 0.242118 0.201256 0.238085 0.237377 0.221123 0.266796 0.220124 0.234358 0.236839 0.232402 0.210238 0.222158 0.207773 0.233774 0.224617 0.229327
chargesum: 0.00000
title: Mulliken charges with hydrogens summed into heavy atoms:
elementType: O C C C C C C C C C C C C C
charge: -0.208828 0.066731 0.352494 0.322875 -0.003198 0.046522 0.487099 0.081412 -0.342788 -0.379258 -0.110980 -0.133516 -0.051431 -0.127134
polarizability: 1.92506858e+02 -4.06728013e+00 1.48408176e+02 -7.99707764e+00 -1.85950341e+00 9.42454552e+01
1716.lowfreq: -8.7970 -6.6811 -0.0005 -0.0004 -0.0001 8.9702 21.1232 26.6187 50.6840
frequency: 20.5296 26.0439 50.5516 54.2460 73.9754 123.5180 130.8934 160.1829 176.2288 202.4336 218.8451 226.1507 248.6668 268.2134 275.2304 324.0886 348.0306 415.9190 483.8578 516.1037 520.0668 538.6237 562.6110 596.1710 620.4380 736.8395 746.1116 770.9864 861.8923 866.3431 890.9059 898.7881 933.7774 949.7994 993.0769 1015.1477 1017.7333 1035.2406 1042.2372 1043.7306 1050.7738 1056.9088 1080.0259 1106.9118 1165.8220 1210.9530 1223.1885 1254.5441 1269.7247 1301.0981 1311.5409 1344.2154 1360.7141 1391.9758 1395.3675 1398.2344 1401.2237 1413.3406 1434.6818 1444.0666 1463.1682 1468.8114 1472.7649 1475.1103 1477.9036 1478.2926 1480.2888 1484.9411 1489.1228 1571.0739 1591.8483 1617.2674 2951.7572 2972.3398 2974.3248 2976.4028 2986.5746 2987.3234 3040.3945 3055.0272 3056.7212 3059.4275 3069.6721 3073.5752 3076.5580 3084.7069 3087.3141 3091.3955 3112.0999 3116.2605
redmass: 1.0365 3.6052 2.3595 2.1721 3.2058 1.0593 1.1173 3.4533 2.9524 2.7548 2.8577 1.7129 1.8780 3.6390 2.6359 2.9989 3.7295 3.5135 3.1192 4.4083 3.0493 4.2554 4.0248 3.0728 2.9855 1.1875 3.5353 5.3482 1.3923 1.3176 1.9051 1.3105 2.4085 2.9763 3.2336 1.6428 1.7288 1.5446 1.6609 1.5452 1.6465 2.5738 1.6144 2.2739 2.0166 1.4169 1.8010 1.4342 1.2804 1.6158 3.9352 1.6163 7.1767 1.2150 1.2535 1.2577 1.2534 2.3333 1.4537 1.4179 1.0662 1.0467 1.0582 1.0773 1.1282 1.0766 1.0739 1.0773 1.3554 6.9624 8.0490 5.8868 1.0686 1.0357 1.0402 1.0373 1.0374 1.0636 1.0943 1.0972 1.0938 1.0936 1.0962 1.0990 1.0995 1.0990 1.0995 1.1002 1.0910 1.0919
irintensity: 0.4200 0.8062 0.3739 0.5275 4.5500 0.8958 0.0437 3.4223 2.8588 2.2137 0.0750 1.0771 2.9649 1.6805 3.2243 0.8348 0.9448 1.0909 1.1652 2.4062 2.0984 3.2765 0.0938 11.9718 0.6904 11.2454 3.0327 3.1001 0.9498 23.2975 21.8850 0.2978 0.9190 0.3217 25.0239 6.8835 3.0248 1.6421 1.8432 0.4629 27.7314 1.4439 3.4844 13.1251 31.8001 6.4906 29.4392 0.8666 41.1525 14.3283 17.2265 24.2026 0.3155 8.8353 13.9292 16.8366 10.5317 5.2639 40.2549 13.7375 19.9501 11.2600 1.8748 1.3842 12.8964 37.0128 16.4284 23.3909 9.6794 42.6475 117.7650 52.0567 6.6753 41.3075 33.9539 31.1500 26.4106 27.0517 2.4176 18.1416 15.6150 9.7470 18.6209 49.9285 78.0534 17.4239 10.7726 14.9617 29.0755 16.3848
temp: 298.150 k
press: 1.00000 atm
elementType: 8 6 6 6 6 6 6 6 6 6 6 6 6 6 1 1 1 1 1 1 1 1 1 1 1 1 1 1 1 1 1 1
symmnumber: 1
zpe: 714421.9 jmol-1
zpe.correction: 0.272109 hartree
zpe.thermalcorrener: 0.288317 hartree
zpe.thermalcorrenthalpy: 0.289261 hartree
zpe.thermalcorrgfe: 0.226614 hartree
zpe.sumelectzpe: -580.353305 hartree
zpe.sumelectthermal: -580.337097 hartree
zpe.sumelectthermalent: -580.336152 hartree
zpe.sumelectthermalfe: -580.398800 hartree
dipole: 1.1871 -1.9371 -1.9459
dipole: 2.9913
quadrupole: -77.5975 -81.8614 -90.2019
quadrupole: 3.1725 2.2298 -4.9425
quadrupole: 5.6228 1.3589 -6.9817 3.1725 2.2298 -4.9425
hfenergy: -580.6254135 hartree
pointgroup: C01 [X(C13H18O1)]
dipole: 0.500928 0.6469156 0.8459251 debye
polarizability: 192.89723|1.7039464|147.8931489|7.0698164|4.5153278|94.37011 unknown
InChI: InChI=1S/C13H18O/c1-5-6-12(14)13-10(3)7-9(2)8-11(13)4/h7-8H,5-6H2,1-4H3
charge 0 multiplicity 1
32 atoms
O  -1.701112 -1.331846 -1.297049
C  0.141547 -0.278186 -0.134122
C  1.058582 -1.372854 -0.011641
C  0.61883 1.065338 -0.076336
C  -2.342795 -0.036899 0.657874
C  -1.323079 -0.575815 -0.355016
C  2.919938 0.231571 0.291429
C  -3.719561 0.304296 0.043168
C  2.424053 -1.094473 0.218304
C  2.00242 1.293546 0.127491
C  0.600389 -2.819596 -0.108753
C  -0.290818 2.27149 -0.27782
C  -4.786709 0.595625 1.118248
C  4.398172 0.49569 0.516388
H  -1.925811 0.81669 1.219469
H  -2.47383 -0.852972 1.403702
H  -4.035481 -0.539172 -0.597186
H  -3.61214 1.181088 -0.626279
H  3.121828 -1.933721 0.334248
H  2.369221 2.3278 0.149971
H  -0.254927 -3.031653 0.559247
H  0.260745 -3.056761 -1.131774
H  1.42144 -3.505958 0.159618
H  0.273436 3.10427 -0.732631
H  -1.146664 2.050409 -0.93822
H  -0.697506 2.64384 0.682735
H  -4.947644 -0.287001 1.765914
H  -5.756678 0.855486 0.656416
H  -4.487054 1.438973 1.769099
H  5.003928 0.129791 -0.33453
H  4.604128 1.573073 0.636146
H  4.765451 -0.023268 1.421293
