program: Gaussian 09
title: 000251131
version: EM64L-G09RevD.01
frameworkgroup: C1[X(C14H16Cl2N2O)]
method: RPBEPBE
basis: SDD
operation: Freq
keyword: #p
keyword: freq=noraman
keyword: PBEPBE/SDD
title: #p freq=noraman PBEPBE/SDD
converged: YES YES NO NO
title: Mulliken charges:
elementType: Cl Cl O N N C C C C C C C C C C C C C C H H H H H H H H H H H H H H H H
charge: -0.059144 -0.047778 -0.279878 -0.158039 -0.473263 0.104952 0.183995 0.159288 0.217875 0.118475 -0.303193 -0.372760 -0.819344 -0.409109 -0.350068 -0.593578 -0.578163 -0.250409 -0.213154 0.332565 0.228306 0.276080 0.244557 0.287039 0.240164 0.235238 0.239405 0.235746 0.237912 0.259501 0.309396 0.271422 0.276319 0.224438 0.225207
chargesum: 0.00000
title: Mulliken charges with hydrogens summed into heavy atoms:
elementType: Cl Cl O N N C C C C C C C C C C C C C C
charge: -0.059144 -0.047778 -0.279878 -0.158039 -0.140698 0.104952 0.183995 0.159288 0.217875 0.118475 0.201194 0.158836 -0.104536 -0.173363 -0.112156 -0.024681 -0.030422 -0.025971 0.012053
polarizability: 2.93986049e+02 2.22929882e+00 1.48495943e+02 6.00429405e+00 2.32091885e+01 1.56454187e+02
1716.lowfreq: -6.1450 -4.3153 0.0018 0.0025 0.0029 3.0318 23.2352 28.7195 36.5464
frequency: 23.1917 28.6858 36.5316 53.5068 63.4128 77.4750 95.5060 100.3606 134.9983 158.8119 187.0937 193.0243 215.2323 224.4371 250.8221 253.8468 278.8336 323.5209 332.2452 382.1880 424.3708 451.4977 461.1229 531.1345 557.4691 573.7459 577.5684 593.1890 632.6052 663.4272 691.3683 707.3838 715.2122 748.5909 756.5160 762.4276 779.3670 784.8191 791.8121 854.1733 882.8748 925.5147 938.7696 976.1520 998.9807 1006.9854 1018.0192 1035.8702 1042.3966 1055.9774 1060.2192 1096.4126 1118.7982 1127.9042 1166.1363 1172.0062 1218.0311 1226.9034 1245.9175 1258.8917 1260.8933 1272.4655 1302.6614 1317.4562 1340.8391 1349.5145 1358.9635 1384.6751 1403.3210 1415.3365 1434.7163 1447.7213 1450.1401 1454.8085 1459.4693 1467.3987 1476.9419 1480.9052 1489.2059 1521.9031 1567.2292 1582.8219 1630.8573 2966.5404 3023.2900 3031.9725 3043.9126 3059.5753 3066.9740 3084.9764 3091.4857 3127.7157 3131.0729 3136.0914 3149.5152 3152.5036 3158.5618 3165.7515 3586.8504
redmass: 7.2502 5.9267 10.7116 5.3723 2.4621 5.0090 3.6765 4.0863 5.0337 2.7347 1.2785 4.4506 4.1310 3.7654 3.2940 5.7553 5.0367 4.3788 3.4336 4.2526 3.5499 3.8423 5.8728 4.7475 4.8188 2.0682 3.8761 1.7361 5.9108 6.3035 6.3363 5.0168 4.9821 2.8879 1.8824 3.4815 1.1928 1.2303 3.8589 1.4677 4.6184 3.1946 1.3737 1.3059 1.4917 2.0758 1.5661 2.6529 1.9045 1.9596 3.6331 2.3265 1.5109 1.5204 1.4671 1.5606 1.9841 1.7697 2.0196 1.2912 1.1585 1.5197 1.2495 2.1704 1.9347 1.4137 1.2768 2.1057 1.2424 2.8676 3.4869 1.1293 3.0958 1.1424 1.1141 1.3437 1.1238 1.3443 2.0702 4.0126 7.2631 6.0323 7.3873 1.0408 1.0597 1.0674 1.0935 1.0566 1.0569 1.0983 1.1049 1.0850 1.1009 1.0890 1.0956 1.1066 1.1120 1.1002 1.0804
irintensity: 0.1224 0.1020 0.4760 0.8368 0.8029 2.6921 5.1489 4.6905 1.9637 2.5660 0.6551 0.5640 1.6882 3.2630 2.6957 8.1918 3.0045 0.5720 15.2201 14.5930 2.3450 22.5080 5.6380 5.9446 6.2183 23.5015 3.2605 78.3925 6.5971 25.1814 43.6059 24.6665 26.8975 75.5733 46.7769 9.6810 17.1299 2.2379 1.5334 0.0771 0.9505 0.7930 2.4365 0.0374 11.0794 10.1595 8.2403 4.9648 3.6147 1.6135 2.1439 12.6445 29.9698 19.1096 26.2196 43.3940 23.7103 51.4158 11.0371 80.0425 10.3740 46.2072 2.9942 49.4271 29.4906 83.5086 5.2842 172.7978 16.2239 14.4420 80.1822 25.2741 10.5384 6.5534 36.9515 7.0773 19.3416 27.1378 8.5548 182.1097 141.4252 1.3405 8.8216 30.6846 11.0988 16.4576 18.6854 14.4607 16.5823 17.2933 5.2914 0.4403 2.1603 2.2792 29.5107 14.2931 5.7060 34.0639 86.3254
temp: 298.150 k
press: 1.00000 atm
elementType: 17 17 8 7 7 6 6 6 6 6 6 6 6 6 6 6 6 6 6 1 1 1 1 1 1 1 1 1 1 1 1 1 1 1 1
symmnumber: 1
zpe: 723090.7 jmol-1
zpe.correction: 0.275411 hartree
zpe.thermalcorrener: 0.294442 hartree
zpe.thermalcorrenthalpy: 0.295386 hartree
zpe.thermalcorrgfe: 0.225034 hartree
zpe.sumelectzpe: -1646.563961 hartree
zpe.sumelectthermal: -1646.544930 hartree
zpe.sumelectthermalent: -1646.543986 hartree
zpe.sumelectthermalfe: -1646.614337 hartree
dipole: 2.0346 1.0987 0.8047
dipole: 2.4484
quadrupole: -130.7856 -145.5069 -116.7169
quadrupole: -8.2750 -2.4992 0.3143
quadrupole: 0.2175 -14.5038 14.2862 -8.2750 -2.4992 0.3143
hfenergy: -1646.839372 hartree
pointgroup: C01 [X(C14H16Cl2N2O1)]
dipole: 0.8158383 -0.1822524 -0.4785959 debye
polarizability: 293.7389329|8.1016698|130.8431324|-5.055495|8.1208739|174.3541133 unknown
InChI: InChI=1S/C14H16Cl2N2O/c1-10-11-4-2-3-5-12(11)17-13(10)14(19)18(8-6-15)9-7-16/h2-5,17H,6-9H2,1H3
charge 0 multiplicity 1
35 atoms
Cl -5.803601 1.601205 0.594853
Cl -1.873931 -3.962488 -1.920587
O  -1.505878 0.596052 2.0256
N  -2.167148 -0.285128 -0.029422
N  1.181735 0.02827 1.481053
C  0.240489 0.189708 0.444925
C  0.920666 0.498672 -0.75171
C  2.333305 0.498097 -0.427052
C  2.464766 0.205924 0.978981
C  -1.182755 0.173924 0.860683
C  -3.581878 -0.073756 0.381528
C  -1.911079 -1.296573 -1.08181
C  0.346718 0.873121 -2.094675
C  3.503579 0.734818 -1.198831
C  3.723985 0.137207 1.618726
C  -3.977218 1.395013 0.167435
C  -2.116215 -2.717759 -0.522991
C  4.757451 0.669925 -0.565665
C  4.864745 0.374924 0.828689
H  0.901267 -0.061827 2.45745
H  -4.227593 -0.725321 -0.230996
H  -3.713198 -0.334108 1.446374
H  -2.594266 -1.126261 -1.93302
H  -0.881269 -1.206954 -1.450061
H  0.8678 1.761558 -2.495912
H  0.467835 0.066349 -2.845003
H  -0.726611 1.119026 -2.029627
H  3.432078 0.958552 -2.269084
H  3.814642 -0.087568 2.686775
H  -3.875051 1.707611 -0.882144
H  -3.429892 2.066395 0.84256
H  -3.134428 -2.891409 -0.144596
H  -1.367479 -2.970634 0.242257
H  5.670492 0.846342 -1.144579
H  5.856938 0.333591 1.291674
