program: Gaussian 09
title: 000245055
version: EM64L-G09RevD.01
frameworkgroup: C1[X(C10H23NO)]
method: RPBEPBE
basis: SDD
operation: Freq
keyword: #p
keyword: freq=noraman
keyword: PBEPBE/SDD
title: #p freq=noraman PBEPBE/SDD
converged: YES YES NO NO
title: Mulliken charges:
elementType: O N C C C C C C C C C C H H H H H H H H H H H H H H H H H H H H H H H
charge: -0.452420 -0.275498 -0.385754 -0.016196 -0.380850 -0.385983 -0.368532 -0.361238 -0.361408 -0.713142 -0.709824 -0.339992 0.215939 0.173102 0.188826 0.186078 0.202109 0.218578 0.180373 0.172699 0.204546 0.185493 0.184349 0.235482 0.211804 0.215043 0.220062 0.202801 0.209958 0.211029 0.204289 0.214815 0.186091 0.187011 0.340360
chargesum: 0.00000
title: Mulliken charges with hydrogens summed into heavy atoms:
elementType: O N C C C C C C C C C C
charge: -0.112060 -0.040016 0.003286 0.172630 0.007337 0.012968 0.008714 0.008605 0.065438 -0.080322 -0.079691 0.033111
polarizability: 1.60916794e+02 1.38304658e+00 1.07348135e+02 2.20957058e-01 1.93274293e+00 9.90590663e+01
1716.lowfreq: -18.6673 -2.6346 -0.0002 0.0006 0.0012 7.6437 24.5260 39.0252 42.9308
frequency: 19.4177 38.1637 40.4420 62.3342 75.8831 108.8606 111.9838 122.4070 147.8097 155.1757 187.3149 198.5203 203.7257 231.8036 272.9449 303.5665 332.8598 390.5315 408.6015 441.8667 493.8819 508.1968 678.8170 746.3844 778.7512 784.1736 821.1255 853.2191 912.6420 931.3875 951.0172 959.5113 964.4704 982.8799 992.0273 1015.0881 1042.7043 1061.8800 1077.2401 1085.8674 1110.1430 1134.3128 1148.4267 1150.7374 1176.8413 1187.4146 1206.7450 1217.5689 1240.4637 1251.9634 1271.6160 1277.5611 1280.3073 1286.9536 1291.3338 1309.8877 1326.9554 1331.1944 1352.2957 1364.2415 1375.2814 1390.9744 1394.7768 1416.7100 1449.5313 1460.5043 1466.8766 1467.9230 1470.0852 1473.9773 1477.2506 1481.0258 1484.5553 1487.7625 1491.4667 1498.7001 2833.0781 2856.7745 2925.9405 2944.2266 2954.6112 2959.7121 2962.0256 2965.7296 2969.5662 2973.2377 2984.0665 2989.3280 2993.3985 2999.3752 3026.9977 3040.3326 3056.9180 3061.0712 3064.9335 3067.8529 3073.1607 3411.8928 3565.5728
redmass: 4.1120 3.0018 2.4055 3.0945 1.8660 3.4670 2.7922 1.8555 2.1040 2.2078 4.1585 1.1401 2.7196 1.1615 1.0866 3.2366 2.9904 2.4507 2.7321 2.5694 2.7883 3.5316 1.3167 1.0723 1.1887 1.1659 2.2174 1.1912 1.1812 1.7498 1.3633 2.0801 2.2105 1.5588 3.0644 2.9323 2.8195 2.9132 2.3749 2.4604 1.3515 2.5851 3.1679 1.3823 1.8079 1.7743 1.3270 1.4153 1.3100 1.2575 1.2278 1.1593 1.1517 1.1066 1.1250 1.2953 1.4361 1.3871 1.4629 1.6067 1.2230 1.3134 1.3720 1.4381 1.2045 1.0707 1.0445 1.0782 1.0703 1.0660 1.0858 1.0532 1.0690 1.0759 1.0927 1.0855 1.0716 1.0702 1.0545 1.0679 1.0600 1.0795 1.0654 1.0355 1.0369 1.1065 1.0847 1.0825 1.0618 1.0962 1.0987 1.1010 1.0992 1.1045 1.0989 1.0995 1.0986 1.0738 1.0664
irintensity: 0.1005 2.5034 3.2178 0.6077 3.4517 1.2970 1.5478 3.1228 1.7649 4.1075 0.1826 0.3500 2.6441 0.1648 156.8641 5.6216 0.7717 1.7217 1.0665 6.3598 6.1439 8.1870 92.9968 9.8119 4.6198 0.5318 1.8703 0.2363 3.8722 5.1337 0.4752 34.5381 19.2846 1.6117 25.3093 4.8795 28.6332 2.0848 0.8976 1.9631 17.7102 19.4868 37.8420 5.0060 4.2596 2.6409 18.2085 2.8122 0.9059 27.0927 1.7209 3.3619 2.3887 0.7980 1.7625 8.0559 0.9547 3.9257 14.7151 7.7024 18.6292 6.7222 6.6603 5.4039 31.7282 1.0365 2.7416 0.7606 0.2800 3.9342 4.1850 9.9807 22.9542 12.2492 1.7368 5.7756 88.3900 131.2294 62.6317 7.3144 15.9245 26.3125 45.6394 41.6907 32.9399 53.3121 29.6804 42.7712 50.6063 14.6495 43.9462 25.2999 5.4123 109.1808 100.0652 52.6086 62.4245 2.5562 2.1135
temp: 298.150 k
press: 1.00000 atm
elementType: 8 7 6 6 6 6 6 6 6 6 6 6 1 1 1 1 1 1 1 1 1 1 1 1 1 1 1 1 1 1 1 1 1 1 1
symmnumber: 1
zpe: 833675.4 jmol-1
zpe.correction: 0.317530 hartree
zpe.thermalcorrener: 0.334137 hartree
zpe.thermalcorrenthalpy: 0.335081 hartree
zpe.thermalcorrgfe: 0.271271 hartree
zpe.sumelectzpe: -523.781631 hartree
zpe.sumelectthermal: -523.765024 hartree
zpe.sumelectthermalent: -523.764080 hartree
zpe.sumelectthermalfe: -523.827890 hartree
dipole: -0.0552 2.4018 0.0862
dipole: 2.4040
quadrupole: -73.1062 -80.8873 -76.6708
quadrupole: 11.3667 4.7958 0.7930
quadrupole: 3.7819 -3.9992 0.2173 11.3667 4.7958 0.7930
hfenergy: -524.0991611 hartree
pointgroup: C01 [X(C10H23N1O1)]
dipole: 0.0146901 -0.9424886 0.0777294 debye
polarizability: 160.9288677|0.9283487|107.132133|-0.6955923|-2.3131902|99.2629942 unknown
InChI: InChI=1S/C10H23NO/c1-10(2)6-8-11-7-4-3-5-9-12/h10-12H,3-9H2,1-2H3
charge 0 multiplicity 1
35 atoms
O  -6.680799 0.4571 -0.237123
N  0.795824 0.335969 -0.063602
C  3.275954 0.513307 -0.155572
C  4.658355 -0.062139 0.253462
C  2.067931 -0.352073 0.254986
C  -1.696484 0.350471 -0.097248
C  -0.421894 -0.437667 0.261462
C  -2.993602 -0.426489 0.220526
C  -4.267585 0.367308 -0.146617
C  4.972809 -1.404713 -0.451186
C  5.77295 0.972229 -0.034399
C  -5.553177 -0.399959 0.172168
H  3.143462 1.513619 0.301978
H  3.264951 0.664356 -1.257704
H  4.636398 -0.24584 1.349543
H  2.135524 -1.359595 -0.228077
H  2.096989 -0.523734 1.350692
H  -1.683755 1.312006 0.4512
H  -1.679841 0.603179 -1.179178
H  -0.450029 -1.435997 -0.249904
H  -0.412607 -0.644945 1.350984
H  -3.010869 -0.678929 1.301787
H  -2.986952 -1.392791 -0.326602
H  0.78253 0.649565 -1.045915
H  -4.263524 0.611781 -1.226742
H  -4.285629 1.329638 0.400434
H  4.243323 -2.191907 -0.188966
H  4.955518 -1.278378 -1.551555
H  5.978031 -1.770912 -0.169968
H  6.762587 0.594252 0.283512
H  5.829121 1.194298 -1.117965
H  5.583899 1.9244 0.495696
H  -5.568836 -1.363703 -0.383598
H  -5.602837 -0.624325 1.260758
H  -7.534535 -0.002986 -0.036868
