program: Gaussian 09
title: 000251112
version: EM64L-G09RevD.01
frameworkgroup: C1[X(C21H22O8)]
method: RPBEPBE
basis: SDD
operation: Freq
keyword: #pfreq=noraman
keyword: PBEPBE/SDD
title: #p freq=noraman PBEPBE/SDD
converged: YES YES NO NO
title: Mulliken charges:
elementType: O O O O O O O O C C C C C C C C C C C C C C C C C C C C C H H H H H H H H H H H H H H H H H H H H H H
charge: -0.237841 -0.284260 -0.251333 -0.289182 -0.253343 -0.270974 -0.259246 -0.264885 0.338898 0.047772 0.038078 -0.038689 0.281447 0.055994 0.071770 0.136421 0.247142 -0.454493 0.173357 -0.511734 0.328139 -0.348458 -0.368402 -0.515111 -0.544841 -0.520143 -0.520821 -0.543995 -0.536121 0.273432 0.280554 0.240679 0.244245 0.210915 0.276742 0.224919 0.226225 0.284899 0.219952 0.220798 0.224280 0.269497 0.261368 0.224265 0.227778 0.228583 0.246293 0.220886 0.220372 0.248377 0.219794
chargesum: 0.00000
title: Mulliken charges with hydrogens summed into heavy atoms:
elementType: O O O O O O O O C C C C C C C C C C C C C C C C C C C C C
charge: -0.237841 -0.284260 -0.251333 -0.289182 -0.253343 -0.270974 -0.259246 -0.264885 0.338898 0.047772 0.038078 -0.038689 0.281447 0.055994 0.071770 0.136421 0.247142 -0.181061 0.173357 -0.231180 0.328139 -0.107779 -0.124157 0.197466 0.186234 0.194432 0.192589 0.151768 0.152422
polarizability: 4.07032349e+02 1.47773072e+00 2.93824117e+02 1.04028179e+01 5.06629486e-02 1.64949997e+02
1716.lowfreq: 0.0003 0.0005 0.0008 1.4571 3.9791 9.3484 23.0434 24.8327 46.7267
frequency: 23.0123 24.7499 46.7095 50.7150 63.3931 69.8014 80.5940 84.4270 86.9035 95.0094 97.5336 113.4299 122.2826 135.7669 148.4848 153.3626 160.9490 165.4417 173.0157 176.6032 179.8650 195.7349 210.6424 215.8694 229.9231 252.5956 257.3405 272.2006 284.5507 301.7658 314.2820 320.2019 325.2381 335.5377 360.7337 372.1197 384.0095 411.6948 415.1683 451.9725 469.3725 505.4012 515.9994 520.0494 526.8935 555.2317 566.7860 610.5310 629.1425 656.2418 671.3408 703.3635 712.0430 730.8780 742.4574 749.3789 797.2996 797.4728 801.1896 846.5955 855.0802 874.3069 893.1741 896.9961 908.9305 914.1409 923.2151 965.5088 981.7206 988.9960 1014.3570 1037.0150 1075.5666 1095.8949 1105.4361 1109.7148 1111.4167 1112.1727 1113.4457 1118.5827 1134.6014 1152.7271 1155.5069 1156.2053 1157.4914 1158.1152 1160.5735 1186.5919 1195.6920 1218.7722 1253.4516 1255.7297 1281.4090 1290.7501 1317.7144 1346.9984 1370.3236 1381.3284 1396.6833 1419.5124 1425.4916 1429.2006 1434.8867 1437.5933 1439.4538 1449.2032 1452.8459 1458.2572 1462.2309 1464.6142 1466.6851 1468.9617 1469.4733 1474.5538 1480.3128 1484.6134 1485.5822 1487.1649 1488.3872 1533.6859 1549.4047 1566.8367 1580.8005 1620.9613 1629.7807 2956.3258 2960.9413 2971.0445 2978.0419 2980.8839 2981.6929 3043.0560 3049.9536 3074.9535 3087.1069 3089.4793 3091.2904 3118.3638 3123.8218 3124.5203 3126.5546 3127.8021 3128.9655 3153.8171 3167.4494 3174.0034 3185.7134
redmass: 4.7387 5.3412 4.4492 4.1374 3.9991 3.0299 3.5874 3.0968 3.3625 3.3761 3.1462 1.9608 2.8908 4.0949 4.2135 1.5389 1.2784 1.2534 1.7772 2.9338 1.6309 4.5169 3.9591 2.9748 1.2227 4.6762 1.2083 5.2220 6.3466 6.5065 4.2322 6.2237 7.3730 5.9750 6.2989 7.1061 4.9506 7.8495 8.6403 4.6770 5.9987 6.0933 6.5375 4.8171 5.5286 7.8852 4.7713 5.4901 6.6696 5.4600 6.1830 6.1383 8.2223 6.8003 4.1864 4.3319 3.2704 2.1184 7.0911 6.3968 7.5457 1.6312 8.8427 1.7312 2.5346 1.8677 8.3530 9.8032 8.2069 7.2458 4.8994 4.2378 7.2670 4.4016 1.2593 1.2365 1.2591 1.3340 1.2594 1.2425 1.5836 1.4937 1.3688 1.3479 1.4458 1.5438 1.4133 2.5758 2.5841 2.3770 2.5331 2.0513 2.9258 4.2381 5.7270 9.5413 3.5497 10.0807 1.9800 2.3845 1.2608 1.3707 1.2664 1.3690 1.2296 1.2005 1.5376 1.0740 1.1231 1.0536 1.0536 1.0877 1.1386 1.0745 1.0569 1.1001 1.0671 1.8877 1.0569 7.9010 9.8715 10.0800 7.4178 7.2583 7.8919 1.0333 1.0327 1.0305 1.0310 1.0314 1.0315 1.1039 1.1041 1.1042 1.1023 1.1010 1.1024 1.1029 1.1039 1.0996 1.0990 1.1047 1.1040 1.0870 1.0924 1.0955 1.0925
irintensity: 0.3143 2.0195 1.1610 4.1785 1.1048 7.0063 3.1997 1.2891 3.4150 3.4476 9.9134 3.9434 4.0532 5.7122 0.2229 0.8964 0.1205 0.3035 1.1877 6.6832 5.6697 4.2847 1.9348 3.1774 0.6107 4.4761 0.7895 15.1302 2.1056 7.0636 6.8099 9.6725 1.7758 0.3060 0.4470 8.2518 0.2617 1.7456 2.7501 3.2295 14.2450 9.6118 0.8928 3.7273 1.8513 14.0882 1.1249 9.8773 5.1455 5.8098 12.3950 32.4212 5.7803 1.4334 2.2191 1.5338 24.0441 22.3496 6.0002 5.3696 11.3178 32.6913 19.0122 25.7038 23.7071 6.3221 28.7223 23.1126 30.4561 101.2751 220.0498 170.7650 196.3851 25.1797 31.2265 15.1672 0.0760 4.7923 0.1020 7.8363 16.4255 4.7673 7.8915 0.4894 16.7580 5.2070 5.9511 87.0333 128.1455 49.1549 16.4117 36.8421 33.6973 57.3663 431.5484 40.4662 211.2173 34.6716 30.7074 148.8545 66.7505 60.8637 3.8759 4.4191 11.1041 20.6753 36.3645 12.8139 16.7714 9.1522 17.8505 69.8876 98.8036 4.5264 22.0124 23.3390 19.4447 109.9183 18.0846 128.3201 79.6246 101.2305 65.6219 127.3620 121.3849 74.7524 61.4445 77.7374 82.5302 89.7912 85.6746 48.5546 40.0800 14.5645 27.3950 26.6658 16.6782 22.8847 15.5596 21.3113 21.5806 17.6989 21.5988 9.4759 0.9968 12.4517 2.9400
temp: 298.150 k
press: 1.00000 atm
elementType: 8 8 8 8 8 8 8 8 6 6 6 6 6 6 6 6 6 6 6 6 6 6 6 6 6 6 6 6 6 1 1 1 1 1 1 1 1 1 1 1 1 1 1 1 1 1 1 1 1 1 1
symmnumber: 1
zpe: 1024565.1 jmol-1
zpe.correction: 0.390236 hartree
zpe.thermalcorrener: 0.420190 hartree
zpe.thermalcorrenthalpy: 0.421134 hartree
zpe.thermalcorrgfe: 0.328940 hartree
zpe.sumelectzpe: -1412.960150 hartree
zpe.sumelectthermal: -1412.930196 hartree
zpe.sumelectthermalent: -1412.929252 hartree
zpe.sumelectthermalfe: -1413.021446 hartree
dipole: -4.6871 -4.2640 0.2913
dipole: 6.3431
quadrupole: -114.0121 -166.9210 -166.4491
quadrupole: 8.8431 -3.8749 -14.7024
quadrupole: 35.1153 -17.7936 -17.3217 8.8431 -3.8749 -14.7024
hfenergy: -1413.3503861 hartree
pointgroup: C01 [X(C21H22O8)]
dipole: 1.8275912 -1.692151 -0.1564634 debye
polarizability: 407.3059232|-2.4433521|293.8546918|5.8272245|0.475965|164.645849 unknown
InChI: InChI=1S/C21H22O8/c1-23-11-7-8-14(24-2)12(9-11)15-10-13(22)16-17(25-3)19(26-4)21(28-6)20(27-5)18(16)29-15/h7-10H,1-6H3
charge 0 multiplicity 1
51 atoms
O  0.372494 -0.523737 0.214689
O  -3.670173 2.304652 -0.4993
O  -1.253867 -2.551742 1.09419
O  -5.202992 0.139448 0.288312
O  -4.000841 -2.351391 0.827075
O  2.217027 -1.944981 -1.44093
O  -0.968952 3.26426 -0.923064
O  5.776462 1.540457 1.200461
C  -1.554714 1.006352 -0.158544
C  -1.011187 -0.264671 0.201861
C  -2.983439 1.14408 -0.116459
C  -1.81239 -1.368103 0.600124
C  1.257546 0.460763 -0.230708
C  -3.801591 0.036455 0.225139
C  -3.221558 -1.219963 0.579736
C  -0.614059 2.08087 -0.592875
C  2.68139 0.054267 -0.172699
C  0.800656 1.693491 -0.626681
C  3.162754 -1.157886 -0.763162
C  3.600495 0.916026 0.462156
C  4.977126 0.59617 0.536183
C  4.535464 -1.477353 -0.679991
C  5.445252 -0.610021 -0.031397
C  -3.590775 3.468388 0.414649
C  -0.605768 -3.427748 0.089767
C  -5.886026 0.406419 -1.001156
C  -4.882493 -2.297444 2.016967
C  2.711136 -3.119257 -2.165433
C  7.206114 1.24726 1.31604
H  1.508777 2.440201 -0.992825
H  3.251773 1.841436 0.929727
H  4.917691 -2.399783 -1.125651
H  6.501656 -0.889071 0.018635
H  -3.871004 3.162972 1.440321
H  -2.578138 3.900957 0.374647
H  -4.325694 4.186442 0.019674
H  -0.231694 -4.289127 0.664227
H  0.230865 -2.900724 -0.401676
H  -1.352922 -3.767686 -0.652381
H  -5.712943 -0.43389 -1.699454
H  -6.955818 0.474383 -0.751262
H  -5.524573 1.35429 -1.432385
H  -5.575541 -1.442662 1.94428
H  -4.267713 -2.229525 2.933955
H  -5.435173 -3.248752 2.006236
H  3.459353 -2.832547 -2.929492
H  1.824249 -3.545356 -2.657031
H  3.149433 -3.865581 -1.474551
H  7.381814 0.31681 1.891128
H  7.631777 2.103472 1.859143
H  7.682932 1.164187 0.319483
