program: Gaussian 09
title: 000251094
version: EM64L-G09RevD.01
frameworkgroup: C1[X(C18H17NO6)]
method: RPBEPBE
basis: SDD
operation: Freq
keyword: #p
keyword: freq=noraman
keyword: PBEPBE/SDD
title: #p freq=noraman PBEPBE/SDD
converged: YES YES NO NO
title: Mulliken charges:
elementType: O O O O O O N C C C C C C C C C C C C C C C C C C H H H H H H H H H H H H H H H H H
charge: -0.272257 -0.492396 -0.267799 -0.256970 -0.423181 -0.201641 -0.500172 0.566774 0.296900 0.434196 -0.479025 0.163444 -0.494337 -0.441152 -0.497965 -0.378036 0.336459 0.160541 -0.341478 0.129416 -0.211951 -0.360855 0.114586 -0.536489 -0.515703 0.214161 0.316919 0.268446 0.225901 0.250112 0.272897 0.253257 0.229943 0.246455 0.374928 0.386337 0.222036 0.224869 0.247938 0.235646 0.271710 0.227537
chargesum: 0.00000
title: Mulliken charges with hydrogens summed into heavy atoms:
elementType: O O O O O O N C C C C C C C C C C C C C C C C C C
charge: -0.272257 -0.117468 -0.267799 -0.256970 -0.036844 -0.201641 -0.183253 0.566774 0.296900 0.434196 -0.264864 0.163444 -0.225891 -0.215251 -0.247853 -0.105138 0.336459 0.160541 -0.088221 0.129416 0.017992 -0.114400 0.114586 0.158354 0.219189
polarizability: 4.48244922e+02 -2.67759201e+01 2.49566533e+02 4.48280497e+00 -7.70983882e+00 1.23144048e+02
1716.lowfreq: -6.9127 -4.4403 -0.0008 0.0002 0.0007 1.4278 10.1602 19.0853 30.4447
frequency: 9.6949 19.0351 30.4244 32.0706 43.7861 69.4974 82.1495 84.5046 112.8599 128.6192 140.6124 157.2009 175.1235 187.0600 191.9230 201.5413 213.4179 239.3456 263.5855 264.3387 276.0165 281.6330 292.3369 304.5127 320.1204 361.9621 385.9063 419.9500 434.4002 442.8624 456.0348 487.9728 505.6585 527.0748 541.8370 551.2906 576.0502 598.8933 603.0161 620.4559 643.0301 657.7310 686.1920 716.1597 725.1670 728.3658 748.9021 778.9874 796.5694 801.5367 808.9741 812.1205 867.7297 884.8918 893.2764 902.2336 906.4793 929.8650 942.3617 963.4684 982.5777 984.0962 1013.4871 1066.0897 1078.0094 1095.8056 1109.8392 1112.7524 1120.4788 1135.8978 1149.8376 1155.8275 1167.9999 1176.8083 1193.7481 1200.5632 1227.9586 1253.2548 1268.8394 1292.1539 1297.1106 1346.9551 1372.0175 1392.2275 1406.4508 1418.2790 1426.6685 1440.9773 1448.6527 1450.5101 1466.3747 1466.5808 1467.9092 1472.9692 1489.3870 1525.7736 1573.0397 1597.5594 1600.6705 1611.9572 1618.5900 1621.8400 1642.2980 2961.9945 3003.0412 3051.0738 3061.8998 3108.6713 3128.3584 3132.1475 3139.9014 3143.9816 3147.6747 3152.9042 3165.6679 3174.8130 3176.8246 3518.3142 3533.4234 3623.5685
redmass: 5.3509 5.3761 5.3316 5.8427 6.5509 4.0428 4.5874 4.1580 5.2806 1.7724 2.1164 5.2038 5.2875 5.1672 5.6567 1.7326 4.4401 4.5598 1.8984 3.5130 2.3317 3.9000 1.8172 6.2174 5.2209 6.9865 4.7873 6.3545 3.3649 3.0753 5.1704 4.9627 1.0934 6.4821 5.3273 4.5854 5.5735 3.3691 2.1860 2.5001 4.1345 7.1645 2.5379 7.2459 3.7154 3.5808 6.3933 5.8387 4.9107 1.6114 6.3847 1.4188 1.4259 1.6563 2.5024 1.4367 2.5199 7.9589 1.4221 3.5899 5.7534 1.3493 4.6698 2.8542 2.4102 1.7473 1.3980 1.2596 2.4881 1.5293 1.4459 1.3627 1.3648 1.2346 1.7223 2.1164 1.9870 2.4159 3.4110 1.5476 1.5652 2.2138 2.1087 9.0917 2.6640 1.2762 2.0121 1.4885 3.7635 1.1093 1.1109 1.8075 1.0510 1.0730 2.1684 3.0843 6.0470 7.0795 6.7304 7.1898 6.5932 7.1744 8.3707 1.0330 1.0292 1.1042 1.0869 1.1042 1.0994 1.0895 1.0874 1.0913 1.1053 1.0915 1.0920 1.0952 1.0978 1.0647 1.0768 1.0665
irintensity: 2.5740 0.9575 0.9043 3.0046 4.6669 1.3808 1.5129 2.9593 3.2233 1.6984 0.7670 3.3231 1.6884 1.0724 0.3603 1.0244 5.7675 3.6203 1.9903 15.5401 42.9210 17.4083 99.8437 18.6834 10.0183 1.7976 7.8408 62.6081 2.8320 5.7244 4.7003 5.3078 136.3840 2.9679 2.1023 10.1525 21.7613 15.4325 6.7837 52.1138 21.6196 0.0733 5.8909 10.5721 4.7211 61.9945 39.4925 3.1086 18.8364 22.0378 21.7622 23.7800 7.3906 16.6381 48.6431 1.0119 24.9820 15.8974 3.2439 49.3882 0.0382 2.5505 69.8361 36.2854 245.9483 30.9026 12.6923 0.1611 128.2536 12.8612 22.7219 4.5619 69.9659 5.3221 361.3369 12.8924 153.6668 63.4492 283.6678 54.4974 85.6994 63.6935 88.1657 29.2565 207.4166 99.7117 41.8845 10.7294 80.7425 24.2776 17.3542 140.4891 15.9809 25.1459 250.0951 37.2086 263.0012 28.5659 76.4310 45.9174 49.5002 108.6519 42.0130 73.6578 33.4951 45.6217 29.8058 15.2940 21.8159 11.3783 12.0428 3.8489 14.8775 11.9804 8.7424 11.6939 13.5461 151.4935 9.2244 43.9579
temp: 298.150 k
press: 1.00000 atm
elementType: 8 8 8 8 8 8 7 6 6 6 6 6 6 6 6 6 6 6 6 6 6 6 6 6 6 1 1 1 1 1 1 1 1 1 1 1 1 1 1 1 1 1
symmnumber: 1
zpe: 831368.1 jmol-1
zpe.correction: 0.316651 hartree
zpe.thermalcorrener: 0.340975 hartree
zpe.thermalcorrenthalpy: 0.341919 hartree
zpe.thermalcorrgfe: 0.259484 hartree
zpe.sumelectzpe: -1200.383613 hartree
zpe.sumelectthermal: -1200.359290 hartree
zpe.sumelectthermalent: -1200.358346 hartree
zpe.sumelectthermalfe: -1200.440781 hartree
dipole: -3.4500 -0.6265 -1.1257
dipole: 3.6827
quadrupole: -106.1846 -131.4425 -155.1471
quadrupole: 30.1508 5.1246 -0.5735
quadrupole: 24.7401 -0.5178 -24.2224 30.1508 5.1246 -0.5735
hfenergy: -1200.7002646 hartree
pointgroup: C01 [X(C18H17N1O6)]
dipole: 1.338324 0.5479587 -0.0887488 debye
polarizability: 444.7654363|2.335275|148.6311089|-39.5309857|50.6828924|227.5589571 unknown
InChI: InChI=1S/C18H17NO6/c1-24-13-5-3-4-12(10-13)17(22)19-14(18(23)25-2)8-11-6-7-15(20)16(21)9-11/h3-10,19-21H,1-2H3
charge 0 multiplicity 1
42 atoms
O  5.573663 0.579622 1.900918
O  -6.083682 -0.800006 -0.267242
O  -1.654269 -1.110348 -2.10463
O  1.428825 -0.748494 -2.295954
O  -6.871903 0.707349 1.817807
O  -0.414582 -2.486797 -0.689631
N  0.930365 0.153904 -0.207716
C  -2.750269 0.653108 0.76471
C  3.276335 0.076312 -0.940043
C  -0.471161 -0.087584 -0.259247
C  -1.309575 0.700607 0.493188
C  1.828641 -0.217137 -1.213025
C  -3.701496 -0.116229 0.027413
C  -3.233365 1.451256 1.845713
C  3.796591 0.203593 0.368675
C  4.141177 0.206235 -2.0595
C  5.17219 0.481195 0.561023
C  -5.052664 -0.088867 0.391648
C  -4.594944 1.474675 2.205443
C  -5.518204 0.697947 1.481772
C  5.505422 0.483461 -1.857374
C  6.035347 0.628871 -0.552901
C  -0.818061 -1.348002 -1.014172
C  6.992098 0.834213 2.169245
C  -1.812733 -2.269837 -3.018444
H  -0.799493 1.505027 1.048371
H  1.281879 0.714729 0.571225
H  -3.378099 -0.688279 -0.847505
H  -2.522497 2.056401 2.420414
H  3.185591 0.040084 1.263223
H  3.722348 0.079256 -3.061843
H  -4.956447 2.0849 3.037728
H  6.172781 0.589515 -2.719482
H  7.10004 0.841562 -0.419652
H  -5.737299 -1.343647 -1.014286
H  -7.359032 0.106411 1.193353
H  7.313817 1.805594 1.746006
H  7.629017 0.022839 1.766863
H  7.075064 0.861895 3.265362
H  -2.25997 -3.129109 -2.489857
H  -0.820272 -2.552941 -3.405635
H  -2.464774 -1.904985 -3.824556
