program: Gaussian 09
title: 000019447
version: EM64L-G09RevD.01
frameworkgroup: C1[X(C16H13ClN2O2)]
method: RPBEPBE
basis: SDD
operation: Freq
keyword: #p
keyword: freq=noraman
keyword: PBEPBE/SDD
title: #p freq=noraman PBEPBE/SDD
converged: YES YES NO NO
title: Mulliken charges:
elementType: Cl O O N N C C C C C C C C C C C C C C C C H H H H H H H H H H H H H
charge: -0.049401 -0.196346 -0.175485 -0.063964 -0.097284 -0.358882 0.127600 0.299034 0.191140 -0.330849 -0.346253 -0.762830 -0.256358 -0.227249 0.199434 -0.218120 -0.249223 -0.352377 -0.066146 -0.183374 -0.229732 0.260432 0.269141 0.277184 0.283550 0.228800 0.252676 0.234386 0.237507 0.236955 0.307652 0.256629 0.239956 0.261797
chargesum: 0.00000
title: Mulliken charges with hydrogens summed into heavy atoms:
elementType: Cl O O N N C C C C C C C C C C C C C C C C
charge: -0.049401 -0.196346 -0.175485 -0.063964 -0.097284 -0.098450 0.127600 0.299034 0.191140 -0.061708 -0.069069 0.002196 -0.021971 0.010257 0.199434 0.018835 0.058429 -0.095748 -0.066146 0.056582 0.032065
polarizability: 2.81777503e+02 7.65091214e+00 2.05534638e+02 1.39216485e+01 3.02227810e+01 1.68707662e+02
1716.lowfreq: -3.3332 -0.0010 0.0010 0.0017 4.1662 6.3553 9.2311 23.1722 37.7191
frequency: 8.3054 23.1335 37.6916 47.7376 51.6242 69.1918 99.9980 120.1883 146.2663 159.2744 177.0272 187.8578 215.1453 242.3445 279.4162 287.1848 316.0013 328.4975 371.9862 391.8926 401.5149 430.6478 443.1552 451.3086 482.1329 493.3027 564.3028 586.6824 612.7812 634.1091 655.0229 673.9423 682.9783 694.7800 708.9904 786.4995 795.2664 807.9560 825.0558 861.6824 893.8491 912.6990 930.1278 940.4393 953.5655 978.3237 982.3241 983.9757 987.9474 995.0091 1000.3915 1012.1017 1025.0059 1034.3126 1059.2168 1085.3890 1090.4481 1152.5666 1171.7917 1175.2581 1180.7018 1195.4041 1211.1083 1264.2723 1274.7045 1281.5045 1327.4676 1368.5479 1384.7754 1388.4606 1399.9829 1422.2486 1437.6042 1447.1176 1449.4758 1450.7916 1480.7338 1565.7332 1570.7340 1593.8968 1598.1179 1610.5426 1636.6046 2954.7661 2988.6058 3077.0557 3123.5544 3131.1748 3139.1086 3149.0582 3149.5369 3159.7552 3168.2808 3171.1365 3177.4130 3180.7416
redmass: 8.1657 5.8941 6.6603 5.1568 4.5837 7.8649 6.0695 5.0188 3.6266 2.1743 5.5193 1.8239 7.0969 5.0534 7.2462 6.3017 5.8199 7.5437 6.6058 6.7272 2.8637 4.0725 3.2346 5.7596 3.7165 4.5412 5.7308 5.3641 6.4082 5.1814 5.8607 6.6426 2.3464 2.3148 2.5220 2.2818 1.4851 3.7799 4.2454 1.2520 4.4006 1.3667 1.4748 2.3657 1.5567 3.1838 4.6649 1.4355 4.2245 1.5225 2.8326 1.3987 2.2811 2.1598 1.9263 1.4986 1.5946 1.8960 1.8310 1.0775 1.9337 1.1456 2.0840 2.0301 1.3563 1.6154 1.3205 1.2294 8.1165 8.7750 6.8371 3.8745 2.2694 1.0751 1.0618 2.3257 2.1623 7.4155 6.5964 6.6066 7.2672 6.2424 9.4495 1.0794 1.0363 1.0964 1.1008 1.0856 1.0887 1.0872 1.0925 1.0962 1.0928 1.1013 1.0928 1.0993
irintensity: 0.1680 0.8005 1.7226 2.5317 1.3613 0.7188 1.0123 0.5336 3.2134 0.0517 0.2015 3.8325 4.1526 0.1961 3.3418 0.7351 7.0355 3.3552 5.8831 3.2054 0.3652 4.8093 5.2272 2.1451 6.0059 8.3374 2.2167 21.7452 0.5145 10.5854 22.3307 17.8204 14.9600 21.6661 55.3945 33.4896 46.6506 39.3159 12.5868 0.3628 19.6999 4.3392 28.8678 17.8791 11.4359 70.4423 3.8630 0.3136 1.5934 0.1147 12.2361 1.6227 3.9612 10.4121 15.1393 2.6762 5.5934 103.5831 106.8732 9.3022 41.8951 32.4932 84.9842 138.0143 13.6669 110.7710 8.0321 74.7071 1.9870 2.8330 26.4396 5.7319 28.6138 37.3953 22.4083 49.2307 2.3629 136.6266 46.8004 63.1302 3.5099 24.0378 100.3466 24.7393 5.0461 8.1805 14.7625 0.2992 4.3747 5.8013 6.6448 11.8071 2.7001 29.8764 2.7280 14.0020
temp: 298.150 k
press: 1.00000 atm
elementType: 17 8 8 7 7 6 6 6 6 6 6 6 6 6 6 6 6 6 6 6 6 1 1 1 1 1 1 1 1 1 1 1 1 1
symmnumber: 1
zpe: 655723.1 jmol-1
zpe.correction: 0.249752 hartree
zpe.thermalcorrener: 0.269081 hartree
zpe.thermalcorrenthalpy: 0.270025 hartree
zpe.thermalcorrgfe: 0.198058 hartree
zpe.sumelectzpe: -1335.976204 hartree
zpe.sumelectthermal: -1335.956875 hartree
zpe.sumelectthermalent: -1335.955931 hartree
zpe.sumelectthermalfe: -1336.027898 hartree
dipole: 2.6428 -5.0547 -3.2024
dipole: 6.5414
quadrupole: -112.9039 -126.2372 -126.8700
quadrupole: 3.5565 5.1135 2.7153
quadrupole: 9.0998 -4.2335 -4.8663 3.5565 5.1135 2.7153
hfenergy: -1336.2259559 hartree
pointgroup: C01 [X(C16H13Cl1N2O2)]
dipole: -1.2109994 1.9446863 -1.1725754 debye
polarizability: 279.0029945|20.1926046|214.5096477|0.4081603|-26.0326857|162.5071605 unknown
InChI: InChI=1S/C16H13ClN2O2/c1-11(20)15(16(21)12-6-3-2-4-7-12)19-18-14-9-5-8-13(17)10-14/h2-10,15H,1H3
charge 0 multiplicity 1
34 atoms
Cl 5.088567 0.409605 2.450113
O  -2.165971 -1.945892 1.32525
O  0.602812 -3.494303 -0.911769
N  0.519463 -0.888045 -0.106976
N  1.019425 -0.032727 -0.942646
C  -0.754302 -1.484445 -0.614774
C  -1.873413 -1.130994 0.404969
C  -2.555567 0.194442 0.282239
C  -0.551167 -3.016358 -0.813923
C  -2.164786 1.179784 -0.66791
C  -3.629005 0.474626 1.17478
C  -1.803147 -3.860188 -0.965009
C  -2.844154 2.414825 -0.724556
C  -4.307056 1.705872 1.110924
C  2.269072 0.558115 -0.530147
C  -3.916873 2.679619 0.158455
C  2.962842 0.196715 0.658197
C  2.792772 1.538665 -1.407859
C  4.171076 0.847181 0.934826
C  4.013393 2.175306 -1.097077
C  4.715496 1.834457 0.081234
H  -1.005278 -1.071788 -1.616298
H  -1.321562 1.000709 -1.343363
H  -3.906674 -0.290677 1.907013
H  -2.211107 -4.069471 0.041231
H  -2.591565 -3.330142 -1.530272
H  -1.550054 -4.810146 -1.460745
H  -2.536107 3.172368 -1.453054
H  -5.13463 1.912021 1.797996
H  -4.443644 3.639089 0.107967
H  2.544581 -0.571201 1.314632
H  2.234892 1.779898 -2.317775
H  4.425897 2.934771 -1.768625
H  5.663974 2.31791 0.332252
