program: Gaussian 09
title: 000251073
version: EM64L-G09RevD.01
frameworkgroup: C1[X(C19H16N2O)]
method: RPBEPBE
basis: SDD
operation: Freq
keyword: #p
keyword: freq=noraman
keyword: PBEPBE/SDD
title: #p freq=noraman PBEPBE/SDD
converged: NO YES NO NO
title: Mulliken charges:
elementType: O N N C C C C C C C C C C C C C C C C C C C H H H H H H H H H H H H H H H H
charge: -0.257946 -0.440360 -0.013769 -0.568196 0.501339 0.501654 0.219130 -0.427514 -0.349960 -0.349857 -0.427740 -0.225494 -0.235528 -0.235676 -0.225418 0.495922 -0.243013 -0.243046 -0.379961 -0.280195 -0.309155 -0.341639 0.185958 0.218286 0.265560 0.265671 0.218254 0.307412 0.225840 0.226862 0.226875 0.225848 0.229938 0.229950 0.222514 0.303139 0.241913 0.242403
chargesum: 0.00000
title: Mulliken charges with hydrogens summed into heavy atoms:
elementType: O N N C C C C C C C C C C C C C C C C C C C
charge: -0.257946 -0.132948 -0.013769 -0.382238 0.501339 0.501654 0.219130 -0.209229 -0.084399 -0.084186 -0.209486 0.000346 -0.008665 -0.008801 0.000430 0.495922 -0.013075 -0.013096 -0.157447 0.022944 -0.067242 -0.099235
polarizability: 2.50862249e+02 -2.83702523e-01 1.94043664e+02 2.27569767e-01 3.93692962e-01 2.10054794e+02
1716.lowfreq: -31.2660 -11.2111 -7.0676 -5.9162 -0.0004 0.0002 0.0002 12.0782 29.2922
frequency: -31.0228 11.9208 29.1641 41.0530 55.1361 78.7108 89.7846 128.6791 181.0671 198.9549 208.0434 251.1017 255.9257 279.5132 336.8432 349.6903 375.7978 398.9401 404.6513 469.7764 472.4424 525.9715 554.3220 555.8657 614.7623 615.2641 639.7354 653.2281 659.0933 695.3269 704.6001 706.4380 740.6131 743.0189 754.5998 794.6283 805.2342 829.8651 845.8190 853.3421 857.3406 868.5896 878.5077 915.8120 920.2394 954.1011 955.6012 959.6753 972.1705 977.2136 985.8787 989.3224 991.8941 994.7726 997.5005 1028.3894 1029.0606 1058.0044 1077.8910 1090.5161 1091.4221 1144.6214 1172.0130 1172.0682 1179.0344 1186.0994 1190.3886 1194.9830 1218.8158 1228.4227 1265.8448 1292.6825 1319.6861 1330.9429 1333.6021 1350.9372 1383.2219 1386.9997 1401.7899 1440.1649 1443.2608 1464.8542 1477.2242 1477.3532 1486.4895 1576.7414 1584.9888 1592.3105 1594.2760 1606.7896 1610.8744 1621.7120 2989.1803 3110.3874 3112.4291 3120.9375 3128.2063 3128.7842 3137.4707 3141.0969 3141.9324 3147.0405 3156.2816 3159.1505 3167.5719 3171.2677 3209.2014 3528.3888
redmass: 3.7399 6.4925 4.1202 3.9823 4.7654 5.2922 6.2800 7.1924 5.1312 4.9652 6.4005 4.6174 4.9890 4.8296 9.7341 5.7423 2.5778 2.7976 2.8645 4.9306 3.4506 3.6773 4.7586 4.1308 6.4543 6.3969 5.5922 1.2033 6.9753 2.5162 3.1901 1.7369 3.3131 2.9462 1.8790 3.3721 4.8296 1.5298 1.2620 1.2489 3.9812 4.4557 1.2610 1.4508 1.8034 4.5282 1.4114 4.9316 1.4014 1.4040 1.3914 5.8227 5.6480 1.3265 1.3319 2.1888 2.3117 2.1233 1.6274 1.5824 1.5758 2.3305 1.0962 1.2414 2.1185 1.6056 1.3111 1.1139 1.3194 1.6453 2.2473 1.7549 2.8733 1.6726 1.2577 1.4634 6.9679 6.1492 1.9920 2.1296 2.1764 1.9382 2.2233 2.3714 2.4467 5.1326 4.8273 5.9839 6.3586 6.1007 5.6563 4.9493 1.0837 1.0879 1.0878 1.0879 1.0863 1.0867 1.0908 1.0923 1.0927 1.0980 1.0957 1.0968 1.1003 1.0981 1.0951 1.0763
irintensity: 0.3160 0.3318 0.0235 0.5273 0.3332 0.2755 7.7616 2.7957 5.7356 3.1733 0.1741 0.6549 0.6440 0.1550 7.7115 0.4365 0.0004 0.0252 0.1989 0.2683 4.3124 40.4270 57.7366 0.6248 0.3005 0.1514 6.8049 41.4263 0.8992 19.7454 14.8134 78.5016 0.9478 35.9099 29.9061 2.6354 18.2462 88.4724 0.0034 1.0019 2.3606 6.4516 5.7307 1.3571 0.0423 13.3470 1.6827 0.8457 0.0001 1.3714 2.5797 0.5919 0.3836 0.0004 1.4341 15.0285 9.6840 0.6095 1.0883 9.8658 19.3401 168.8078 0.0809 0.8764 0.6677 0.0046 2.2871 3.2744 14.5124 4.2832 3.8840 26.5567 86.5703 15.5223 4.1015 52.4049 0.0743 2.5821 72.9403 0.5302 21.6448 12.4536 67.8196 323.5024 151.1803 206.2238 104.1319 0.2016 11.8794 16.1879 8.2187 45.0632 27.3667 8.9949 12.1153 9.6925 0.3514 0.7636 30.9594 3.0441 54.3806 17.7761 25.3569 18.9464 21.2696 11.4652 5.2526 11.2226
temp: 298.150 k
press: 1.00000 atm
elementType: 8 7 7 6 6 6 6 6 6 6 6 6 6 6 6 6 6 6 6 6 6 6 1 1 1 1 1 1 1 1 1 1 1 1 1 1 1 1
symmnumber: 1
zpe: 788227.5 jmol-1
zpe.correction: 0.300220 hartree
zpe.thermalcorrener: 0.317456 hartree
zpe.thermalcorrenthalpy: 0.318401 hartree
zpe.thermalcorrgfe: 0.252269 hartree
zpe.sumelectzpe: -916.837165 hartree
zpe.sumelectthermal: -916.819929 hartree
zpe.sumelectthermalent: -916.818984 hartree
zpe.sumelectthermalfe: -916.885116 hartree
dipole: 3.1002 -0.0085 -3.4527
dipole: 4.6403
quadrupole: -150.0990 -123.9883 -111.0523
quadrupole: -0.0129 5.7487 0.1479
quadrupole: -21.7191 4.3915 17.3276 -0.0129 5.7487 0.1479
hfenergy: -917.137385 hartree
pointgroup: C01 [X(C19H16N2O1)]
dipole: -1.1940552 0.1370397 1.3741817 debye
polarizability: 250.2553822|-5.8425492|194.6444243|-0.335468|-0.2414184|210.0609003 unknown
InChI: InChI=1S/C19H16N2O/c22-19(21-17-11-13-20-14-12-17)18(15-7-3-1-4-8-15)16-9-5-2-6-10-16/h1-14,18,21H
charge 0 multiplicity 1
38 atoms
O  0.629357 -0.047984 -1.479453
N  1.663175 -0.154595 0.620141
N  5.817033 -0.603038 -0.306778
C  -0.788291 0.124259 0.540623
C  -1.441793 1.48882 0.243806
C  -1.735568 -1.059294 0.260159
C  0.549308 -0.034413 -0.216197
C  -1.910553 2.272065 1.328346
C  -2.01923 -1.505268 -1.055398
C  -1.617001 1.971811 -1.077692
C  -2.367946 -1.70209 1.353917
C  -2.550355 3.511317 1.102281
C  -2.91995 -2.57228 -1.265693
C  -2.251378 3.213097 -1.302869
C  -3.273153 -2.766155 1.142779
C  3.026961 -0.303611 0.260588
C  -2.723872 3.986143 -0.217237
C  -3.553377 -3.204564 -0.170993
C  3.984154 -0.410261 1.30606
C  3.49269 -0.350473 -1.080506
C  5.345504 -0.556155 0.976435
C  4.879846 -0.49915 -1.29696
H  -0.578769 0.10689 1.628256
H  -1.782392 1.909195 2.3563
H  -1.516069 -1.033954 -1.904992
H  -1.235697 1.387892 -1.920782
H  -2.158649 -1.365442 2.377501
H  1.476613 -0.130526 1.625492
H  -2.909411 4.102755 1.951918
H  -3.126856 -2.910921 -2.287099
H  -2.376387 3.577352 -2.328744
H  -3.755086 -3.250445 1.999403
H  -3.218292 4.947196 -0.396939
H  -4.253818 -4.030009 -0.339436
H  3.677638 -0.380284 2.358725
H  2.794127 -0.272944 -1.913528
H  6.099639 -0.639954 1.767012
H  5.267149 -0.537681 -2.321442
