program: Gaussian 09
title: 000234146
version: EM64L-G09RevD.01
frameworkgroup: C1[X(C21H26Cl2O6S2)]
method: RPBEPBE
basis: SDD
operation: Freq
keyword: #p
keyword: freq=noraman
keyword: PBEPBE/SDD
title: #p freq=noraman PBEPBE/SDD
converged: NO YES NO NO
title: Mulliken charges:
elementType: Cl Cl S S O O O O O O C C C C C C C C C C C C C C C C C C C C C H H H H H H H H H H H H H H H H H H H H H H H H H H
charge: -0.027407 -0.024192 0.995918 0.969926 -0.397806 -0.410481 -0.497596 -0.555248 -0.495504 -0.513332 -0.405082 -0.392127 -0.388340 -0.358367 -0.373470 -0.373343 -0.364568 -0.318717 -0.335295 -0.027166 -0.043643 -0.196769 -0.233699 -0.241863 -0.210457 -0.182837 -0.186013 -0.186871 -0.199639 -0.112754 -0.104693 0.198327 0.193740 0.186276 0.229137 0.189510 0.193503 0.183516 0.222807 0.241119 0.204622 0.193917 0.254646 0.208534 0.199248 0.236011 0.231639 0.226018 0.253058 0.310571 0.288859 0.292769 0.357009 0.273141 0.270274 0.271183 0.281998
chargesum: 0.00000
title: Mulliken charges with hydrogens summed into heavy atoms:
elementType: Cl Cl S S O O O O O O C C C C C C C C C C C C C C C C C C C C C
charge: -0.027407 -0.024192 0.995918 0.969926 -0.397806 -0.410481 -0.497596 -0.555248 -0.495504 -0.513332 -0.013015 0.023287 -0.005327 0.047956 0.072271 0.075220 0.043214 0.148933 0.143782 -0.027166 -0.043643 0.113802 0.055160 0.050906 0.146552 0.090304 0.084261 0.084311 0.082359 -0.112754 -0.104693
polarizability: 3.39722039e+02 2.53709332e+01 3.08847656e+02 -2.46309738e+00 -4.17598377e+00 3.25770522e+02
1716.lowfreq: -9.9242 -3.7432 -3.1938 0.0009 0.0014 0.0022 7.9609 12.0645 18.3320
frequency: 3.3818 11.3004 18.3188 27.5622 30.9935 39.5042 48.4970 52.1918 53.7323 56.2379 66.6939 72.9531 97.4135 107.6992 110.8808 116.7682 120.7923 124.8322 135.5834 140.7109 162.9187 182.6977 202.5249 213.9207 219.3196 224.1055 233.2193 244.1936 266.0744 266.6481 282.7123 289.4864 291.3189 312.2304 333.9955 352.1788 356.9952 372.1386 372.7288 373.7361 411.9341 413.1987 416.4780 420.2491 448.8397 463.2687 489.4044 491.5651 503.2765 505.5578 514.6744 529.1688 543.7596 610.2703 610.8591 697.0911 698.1112 707.6962 710.3005 714.7762 736.2762 768.0001 795.6100 820.2492 825.8889 828.4466 830.7489 832.6024 839.6749 842.5031 849.2263 852.5009 873.7563 904.0739 922.6415 950.1346 954.6128 964.0237 965.8003 978.1288 981.2787 984.5148 994.5798 995.6103 1003.3956 1015.6563 1029.3089 1045.8758 1048.1482 1066.8931 1067.4306 1071.6152 1081.5982 1107.7598 1110.6465 1112.3019 1113.4933 1121.5803 1146.8523 1161.3531 1175.1391 1183.1241 1211.3370 1217.6357 1238.2580 1257.6772 1274.1085 1280.6786 1280.9400 1288.7185 1289.3112 1294.9152 1314.9794 1335.6692 1340.5048 1342.7045 1346.9352 1353.1154 1364.8841 1372.2097 1378.4720 1381.5014 1383.5497 1384.0955 1443.3241 1448.4260 1448.5832 1451.1135 1453.2021 1454.6083 1463.1699 1472.2615 1472.9626 1485.2703 1492.0195 1564.4047 1565.7013 1591.3794 1593.8902 2956.1241 2959.5977 2960.7491 2963.1824 2967.0108 2967.7186 2972.0807 2975.5021 2989.5112 3003.4376 3013.6244 3017.5362 3025.8476 3032.8946 3037.2580 3049.3683 3060.4590 3062.0045 3122.0404 3156.1623 3160.6594 3161.1584 3180.1405 3180.4529 3182.8130 3182.8746
redmass: 6.7208 11.1896 9.3581 7.0764 8.6859 5.8983 5.6125 4.9472 4.7384 7.5725 6.3137 5.0322 2.8256 4.0352 4.0222 4.4908 8.4541 2.8140 8.2298 3.7305 3.8790 3.4751 8.3333 11.1106 7.1527 5.5764 2.5039 3.8881 6.4518 7.5823 3.1256 3.9472 6.2945 4.7982 3.6618 5.6072 9.5455 6.4794 3.2043 5.5014 2.9593 2.9982 8.2496 6.9291 4.4677 3.8892 3.2137 3.5876 3.1063 3.4988 5.5028 5.5079 7.2136 7.1334 7.1470 4.7145 4.9097 5.8414 5.9704 1.1406 1.1939 1.5538 2.3319 4.3459 2.2402 1.5173 4.1882 1.4626 2.1127 1.5844 2.7549 1.3368 2.1555 1.8612 1.6552 15.5277 11.3445 1.3534 1.3306 5.5322 6.1761 1.3980 1.5080 2.0813 2.3681 1.9731 1.7852 2.7144 2.5761 3.4137 3.1231 2.3613 2.1365 1.3226 2.2164 2.3203 1.3526 2.2966 1.3656 1.3792 1.1223 1.1372 1.2819 1.2391 1.2764 1.3103 1.2452 1.2033 1.2262 1.2407 1.1727 1.1054 1.1265 1.3323 1.2846 1.2884 1.2901 1.3811 1.5780 1.4879 3.1777 5.4278 6.8154 4.4071 1.0830 2.0039 1.1083 1.9585 1.1084 1.0915 1.0799 1.0765 1.0829 1.0882 1.0930 6.0653 6.3019 8.0361 8.1351 1.0592 1.0637 1.0584 1.0631 1.0632 1.0630 1.0658 1.0629 1.0590 1.0982 1.0947 1.0973 1.0942 1.1004 1.1027 1.1035 1.1021 1.1008 1.0945 1.0920 1.0898 1.0898 1.0947 1.0962 1.0968 1.0970
irintensity: 1.1859 0.4768 1.2188 0.1882 0.1182 0.1257 0.1288 0.1122 0.1825 0.3744 0.7121 0.0749 0.5143 1.6699 2.7472 2.7462 5.8488 0.8654 12.6042 0.7200 1.2283 1.8524 5.9708 4.8740 2.7955 0.7385 5.0867 9.3615 0.8022 3.7205 1.4400 0.2855 2.9726 0.9005 7.4042 9.9577 5.2946 7.2145 4.1417 23.3291 1.0455 2.1304 42.3785 38.8083 29.3373 4.0123 5.5184 1.6573 10.3555 30.6817 24.9828 138.4527 178.7592 0.6278 0.3618 9.4089 11.9332 32.3199 32.7017 15.1575 0.3532 12.9181 32.4525 78.5163 36.2317 16.4906 117.1406 4.4474 70.9650 5.5389 49.9835 49.9680 10.8137 19.2750 8.7621 168.1086 33.9709 0.1484 0.8330 27.8291 34.4658 3.4632 1.4713 27.4435 31.4490 2.9512 18.4644 24.4367 18.6406 66.8627 60.7729 11.1022 2.5051 13.6716 0.4640 1.6993 4.2822 0.8940 4.5106 4.5554 2.1017 3.3280 14.3846 7.0634 2.6137 3.9702 1.3423 0.8697 7.0374 2.5930 1.2804 1.7099 0.3837 11.3201 17.5918 11.5647 6.9003 1.1996 2.0786 4.9824 34.5645 24.6004 1.3280 7.8431 13.2936 43.2314 2.2786 50.1832 5.1116 25.7201 8.9150 0.6166 6.7480 26.9128 3.5458 48.7537 49.4745 4.6805 2.8776 20.3172 12.1668 5.0296 34.0339 15.8491 17.8023 86.7213 40.5277 41.5261 19.6312 37.9285 16.4271 40.8798 24.4182 19.2917 72.0338 48.0807 60.1370 97.1109 27.1364 2.7028 2.2750 1.0289 0.3307 3.3785 2.4529
temp: 298.150 k
press: 1.00000 atm
elementType: 17 17 16 16 8 8 8 8 8 8 6 6 6 6 6 6 6 6 6 6 6 6 6 6 6 6 6 6 6 6 6 1 1 1 1 1 1 1 1 1 1 1 1 1 1 1 1 1 1 1 1 1 1 1 1 1 1
symmnumber: 1
zpe: 1133554.1 jmol-1
zpe.correction: 0.431748 hartree
zpe.thermalcorrener: 0.465828 hartree
zpe.thermalcorrenthalpy: 0.466772 hartree
zpe.thermalcorrgfe: 0.359397 hartree
zpe.sumelectzpe: -2980.718642 hartree
zpe.sumelectthermal: -2980.684562 hartree
zpe.sumelectthermalent: -2980.683618 hartree
zpe.sumelectthermalfe: -2980.790993 hartree
dipole: -0.6171 1.0555 2.9286
dipole: 3.1735
quadrupole: -203.4576 -221.0588 -213.3540
quadrupole: -1.7694 7.4268 2.1708
quadrupole: 9.1659 -8.4353 -0.7306 -1.7694 7.4268 2.1708
hfenergy: -2981.1503897 hartree
pointgroup: C01 [X(C21H26Cl2O6S2)]
dipole: -0.1053132 -0.3346433 -1.1982599 debye
polarizability: 351.8486453|5.0788756|309.0457931|-10.5470763|14.6569462|313.445779 unknown
InChI: InChI=1S/C21H26Cl2O6S2/c22-18-8-12-20(13-9-18)30(24,25)28-16-6-4-2-1-3-5-7-17-29-31(26,27)21-14-10-19(23)11-15-21/h8-15H,1-7,16-17H2
charge 0 multiplicity 1
57 atoms
Cl -2.289998 1.250999 -5.346384
Cl -5.500053 -2.020977 3.186087
S  -0.503242 3.074662 0.563577
S  0.568212 -2.376638 1.086979
O  1.273994 3.377097 0.157617
O  0.285839 -1.906897 -0.737132
O  -1.2214 4.476929 0.935107
O  -0.631595 1.830665 1.599605
O  1.453854 -1.223862 1.801165
O  1.060217 -3.924496 1.098762
C  5.402014 -0.083151 -0.264872
C  4.648331 0.573887 0.923382
C  4.496934 -0.522806 -1.44733
C  3.826047 1.824011 0.536527
C  3.343941 -1.45599 -1.014644
C  2.956203 2.347344 1.701484
C  2.359881 -1.796343 -2.152168
C  2.168062 3.610959 1.338405
C  1.166144 -2.643092 -1.687022
C  -1.000101 2.537314 -1.160565
C  -1.203147 -2.260091 1.674424
C  -0.775301 1.202738 -1.535472
C  -1.960676 -3.443948 1.692933
C  -1.592908 3.501289 -1.992447
C  -1.679598 -1.006042 2.088988
C  -1.179654 0.810069 -2.831037
C  -3.288242 -3.365686 2.165756
C  -1.991802 3.101189 -3.286954
C  -3.012811 -0.937685 2.553814
C  -1.774707 1.764374 -3.681872
C  -3.789885 -2.113889 2.583015
H  5.951713 -0.968745 0.115008
H  6.169338 0.621518 -0.647224
H  5.388625 0.852739 1.701622
H  3.974047 -0.167487 1.395185
H  5.122873 -1.027257 -2.211955
H  4.069734 0.372932 -1.942932
H  4.510311 2.626519 0.187077
H  3.157369 1.591311 -0.313639
H  2.781632 -0.968704 -0.198146
H  3.762566 -2.391741 -0.588559
H  3.599893 2.594856 2.572301
H  2.257486 1.555179 2.032161
H  1.986824 -0.861038 -2.615979
H  2.879648 -2.363014 -2.953667
H  1.572367 3.993444 2.190304
H  2.830671 4.42325 0.984041
H  0.48716 -2.902503 -2.52213
H  1.497592 -3.588363 -1.207763
H  -0.314345 0.470166 -0.865133
H  -1.526915 -4.395653 1.371266
H  -1.750531 4.524835 -1.638657
H  -1.059659 -0.102266 2.054851
H  -1.031709 -0.221865 -3.159563
H  -3.916801 -4.259035 2.207983
H  -2.458312 3.815074 -3.970815
H  -3.427634 0.018521 2.883138
