program: Gaussian 09
title: 000251057
version: EM64L-G09RevD.01
frameworkgroup: C1[X(C14H30O3)]
method: RPBEPBE
basis: SDD
operation: Freq
keyword: #pfreq=noraman
keyword: PBEPBE/SDD
title: #p freq=noraman PBEPBE/SDD
converged: YES YES NO NO
title: Mulliken charges:
elementType: O O O C C C C C C C C C C C C C C H H H H H H H H H H H H H H H H H H H H H H H H H H H H H H
charge: -0.294741 -0.288245 -0.448789 -0.023391 -0.424341 -0.402141 -0.305426 -0.364489 -0.354571 -0.726657 -0.275298 0.016270 -0.697847 -0.709522 -0.230482 -0.393569 -0.316163 0.207526 0.195820 0.183807 0.202394 0.223530 0.189696 0.183912 0.189718 0.201566 0.193777 0.194592 0.217518 0.214476 0.220681 0.207069 0.189316 0.188380 0.215620 0.210255 0.209941 0.248429 0.210625 0.217757 0.174887 0.179902 0.229224 0.230476 0.183190 0.184241 0.341076
chargesum: 0.00000
title: Mulliken charges with hydrogens summed into heavy atoms:
elementType: O O O C C C C C C C C C C C C C C
charge: -0.294741 -0.288245 -0.107713 0.184136 -0.044715 0.023782 0.068182 0.026795 0.033798 -0.073982 0.121087 0.204651 -0.062032 -0.032710 0.124307 0.066132 0.051269
polarizability: 2.21258882e+02 -4.04404028e-01 1.46224990e+02 -2.92781737e-01 -2.52736438e+00 1.34969154e+02
1716.lowfreq: -24.7728 -17.9276 -1.6881 -0.0009 0.0006 0.0011 5.0427 17.7517 28.7780
frequency: -19.6799 17.4542 28.6615 38.8352 41.0521 42.5451 59.5645 72.7546 79.9281 111.1231 112.4919 120.8830 129.0269 137.8375 150.8940 166.9889 203.4598 214.6049 224.3845 240.7689 258.2027 266.8982 272.7951 301.1381 317.5906 331.7698 396.3844 421.3274 456.9608 472.3914 522.1453 541.1081 551.2014 727.2802 758.0845 770.2430 797.5357 807.1341 822.8230 886.0069 888.9947 897.7225 914.4507 922.1698 927.8285 968.4481 972.0240 979.9913 988.8290 1017.0989 1024.9221 1030.3204 1038.9432 1056.0135 1075.8453 1080.7983 1086.9485 1093.0085 1116.7512 1129.5327 1133.7911 1153.1552 1156.3793 1167.9043 1177.4256 1200.5510 1211.9552 1214.4455 1221.9350 1248.8809 1265.5281 1268.2203 1275.2955 1279.9236 1284.2132 1288.8461 1296.7309 1306.0643 1327.3959 1334.5800 1343.6253 1352.4595 1356.7588 1360.8676 1371.3697 1387.0542 1389.6357 1393.1063 1404.3394 1420.1977 1460.0640 1465.0130 1466.6825 1467.8774 1471.8836 1473.8340 1474.4947 1476.6004 1477.5346 1483.7584 1484.8246 1485.7793 1490.4748 1492.8316 1496.4915 2910.5614 2911.3456 2925.9646 2934.1426 2942.7018 2950.0789 2952.5184 2957.5748 2962.0178 2967.4556 2970.1304 2971.5741 2971.6986 2976.6332 2986.1418 2989.5596 2996.9859 2997.0647 3007.8787 3021.0264 3034.3278 3039.4511 3067.9533 3069.2492 3070.4134 3073.1718 3084.0719 3087.6244 3093.2537 3567.3655
redmass: 2.7991 4.3947 4.0878 2.2771 2.9737 3.1392 1.6449 2.9045 3.7829 2.6707 2.4524 2.7856 2.4461 3.1698 1.5741 4.4409 2.7843 1.2388 1.1217 1.3573 3.6873 2.3530 1.0889 2.4688 3.3983 3.4068 3.2968 2.8943 2.8396 3.0703 2.4121 2.6347 3.2756 1.0948 1.3013 1.7252 1.0769 1.3963 3.0716 1.1758 1.7964 2.9000 1.3051 1.3420 3.3548 3.6384 1.9137 2.2943 1.8762 2.5395 1.4016 3.3436 2.7367 4.7022 2.6628 2.7145 3.0687 2.1729 1.6314 1.5467 1.8712 2.1369 1.8553 2.1329 1.1900 1.2214 1.4063 1.2792 1.3412 1.2525 1.1760 1.2079 1.1180 1.1549 1.1803 1.0703 1.2578 1.3194 1.4235 1.3296 1.4916 1.4566 1.4439 1.4909 1.2720 1.2321 1.2189 1.3723 1.5069 1.4704 1.0702 1.0728 1.0581 1.0650 1.0570 1.0741 1.0721 1.0468 1.0705 1.0771 1.0645 1.0671 1.0747 1.0670 1.0854 1.0560 1.0548 1.0549 1.0619 1.0774 1.0867 1.0673 1.0599 1.1031 1.0597 1.0896 1.0363 1.1060 1.0365 1.0362 1.0792 1.1058 1.0835 1.1005 1.0594 1.1038 1.0984 1.1006 1.0985 1.0993 1.1004 1.1002 1.1048 1.0989 1.0664
irintensity: 1.0792 0.0273 0.6361 10.3666 0.1718 4.0405 0.1383 0.2903 1.1480 1.1091 0.0969 0.9975 5.0716 4.5943 1.4963 0.2551 1.3000 0.6670 0.0091 0.1154 3.2377 0.5220 160.6647 0.1215 3.6518 3.3699 7.9597 4.8462 15.1244 1.5523 3.8814 6.7472 4.0025 9.3353 12.4179 8.2079 3.2450 3.1145 4.7664 0.2098 7.1012 9.4964 4.1907 5.2934 4.7093 80.4805 30.3656 7.3913 1.6958 18.7860 3.3520 2.7997 22.2152 97.0300 37.1325 27.1297 203.1687 38.6786 1.2098 6.0497 2.5711 2.1422 0.9105 2.6093 0.2302 1.5434 1.0950 28.1513 18.4760 2.2063 2.1027 1.2916 1.0692 6.2361 8.4938 0.9212 6.8597 31.7242 0.8158 3.8687 4.1819 0.3586 0.1128 0.7260 32.1507 18.4528 11.2659 15.9760 0.4877 8.9814 2.4567 1.7323 1.7237 5.1929 14.0038 0.0650 6.8352 15.1833 11.3153 10.2892 5.0318 19.0099 3.0020 11.5436 4.0044 57.6176 20.5332 101.3068 27.5718 73.2494 10.1528 21.7337 6.2152 18.8327 90.6898 36.5030 38.8766 89.6117 31.6266 25.7925 15.6132 69.1088 39.8951 17.4649 18.8778 82.9029 8.0785 94.0034 43.6509 57.4171 78.6705 41.5213 39.5413 23.6619 2.3971
temp: 298.150 k
press: 1.00000 atm
elementType: 8 8 8 6 6 6 6 6 6 6 6 6 6 6 6 6 6 1 1 1 1 1 1 1 1 1 1 1 1 1 1 1 1 1 1 1 1 1 1 1 1 1 1 1 1 1 1
symmnumber: 1
zpe: 1102560.0 jmol-1
zpe.correction: 0.419943 hartree
zpe.thermalcorrener: 0.442385 hartree
zpe.thermalcorrenthalpy: 0.443329 hartree
zpe.thermalcorrgfe: 0.365130 hartree
zpe.sumelectzpe: -775.670345 hartree
zpe.sumelectthermal: -775.647903 hartree
zpe.sumelectthermalent: -775.646959 hartree
zpe.sumelectthermalfe: -775.725158 hartree
dipole: -0.2622 0.9027 -1.7926
dipole: 2.0241
quadrupole: -93.3425 -109.6612 -109.3957
quadrupole: -10.0309 17.3670 2.0033
quadrupole: 10.7906 -5.5280 -5.2626 -10.0309 17.3670 2.0033
hfenergy: -776.0902884 hartree
pointgroup: C01 [X(C14H30O3)]
dipole: 0.1845512 0.0750911 -0.7710297 debye
polarizability: 220.3692449|-0.1658898|140.7724811|8.4342841|6.1837851|141.3113 unknown
InChI: InChI=1S/C14H30O3/c1-4-6-8-14(5-2)12-16-11-13(3)17-10-7-9-15/h13-15H,4-12H2,1-3H3
charge 0 multiplicity 1
47 atoms
O  -0.155113 0.093744 -0.209995
O  3.38856 0.00401 0.718674
O  8.001028 0.801131 1.857203
C  -2.58786 0.155884 -0.451773
C  -3.915609 0.389868 0.320635
C  -2.582677 -1.127844 -1.32944
C  -1.412669 0.176874 0.543067
C  -5.169484 0.496033 -0.576136
C  -6.446336 0.851379 0.220207
C  -2.843069 -2.45078 -0.573433
C  1.018756 0.050538 0.665507
C  2.259027 -0.06939 -0.231756
C  -7.706167 0.936141 -0.668257
C  2.26008 -1.363383 -1.062423
C  4.695574 0.202469 0.084159
C  5.712002 0.419351 1.211555
C  7.137313 0.601802 0.680976
H  -2.437708 1.016659 -1.138049
H  -4.067715 -0.422021 1.062282
H  -3.822449 1.32773 0.908665
H  -3.338234 -1.0130 -2.13112
H  -1.598581 -1.185096 -1.830942
H  -1.430951 1.118694 1.137317
H  -1.479096 -0.675101 1.257934
H  -4.999903 1.264917 -1.359018
H  -5.33517 -0.461255 -1.110247
H  -6.293629 1.818419 0.741861
H  -6.601847 0.092143 1.014116
H  -3.836107 -2.461713 -0.087056
H  -2.806538 -3.307097 -1.271774
H  -2.08113 -2.631235 0.207071
H  1.091434 0.975606 1.275776
H  0.964176 -0.82163 1.353944
H  2.290314 0.813516 -0.909225
H  -8.603945 1.193539 -0.076531
H  -7.586025 1.706784 -1.453131
H  -7.89991 -0.028693 -1.17415
H  1.312289 -1.431194 -1.624528
H  3.095582 -1.391017 -1.784364
H  2.339604 -2.24221 -0.396711
H  4.65562 1.086532 -0.593831
H  4.972174 -0.685757 -0.525878
H  5.425374 1.308972 1.800365
H  5.687385 -0.449042 1.894295
H  7.186693 1.48221 0.002134
H  7.453018 -0.298451 0.108144
H  8.937818 0.924163 1.560577
