program: Gaussian 09
title: 000251036
version: EM64L-G09RevD.01
frameworkgroup: C1[X(C11H11N3S)]
method: RPBEPBE
basis: SDD
operation: Freq
keyword: #p
keyword: freq=noraman
keyword: PBEPBE/SDD
title: #p freq=noraman PBEPBE/SDD
converged: YES YES NO NO
title: Mulliken charges:
elementType: S N N N C C C C C C C C C C C H H H H H H H H H H H
charge: 0.224410 -0.108598 -0.650700 -0.647528 -0.024971 -0.191353 -0.359341 -0.428148 0.175351 0.190744 -0.273629 -0.204759 -0.208006 -0.222632 -0.237065 0.252950 0.236098 0.254769 0.269250 0.230307 0.230763 0.230601 0.320073 0.310968 0.310397 0.320048
chargesum: 0.00000
title: Mulliken charges with hydrogens summed into heavy atoms:
elementType: S N N N C C C C C C C C C C C
charge: 0.224410 -0.108598 -0.019659 -0.017083 -0.024971 -0.191353 -0.106392 -0.192050 0.175351 0.190744 -0.018860 0.064491 0.022301 0.008131 -0.006464
polarizability: 2.36947590e+02 -1.89299509e+01 1.52397670e+02 1.71017575e+01 4.51273992e+00 9.92381797e+01
1716.lowfreq: -8.7706 -5.7854 -0.0012 0.0009 0.0013 2.0601 15.1325 30.4856 56.5725
frequency: 12.1377 30.4626 56.5671 155.0432 172.2592 181.8391 216.9143 228.0768 253.7236 307.3229 335.8148 343.3777 385.3023 401.9017 416.2205 457.1762 467.8367 481.6817 503.4119 533.6849 573.9410 583.3712 610.4922 652.4424 676.6267 694.8354 720.0126 751.4703 802.7179 811.9349 830.3050 848.3349 918.1055 932.3181 974.8203 982.6987 985.3771 993.8390 1006.2984 1015.9728 1072.9073 1074.2914 1103.5264 1127.9508 1171.3009 1184.1616 1240.7193 1303.7305 1358.3528 1374.5751 1381.3504 1425.8734 1451.1039 1455.1172 1459.8075 1570.3193 1577.5307 1586.6788 1589.0194 1606.5310 1621.1018 3127.4064 3136.8101 3150.1200 3155.8247 3158.6585 3163.0758 3169.3128 3560.1052 3561.3761 3716.3378 3716.6070
redmass: 5.3672 4.2789 5.1678 5.5154 4.4308 3.5711 5.4054 5.3973 5.4649 3.0118 1.2172 1.1873 6.7218 3.0412 9.0787 1.0570 2.9304 1.0811 3.5865 6.0631 6.6492 6.5214 6.4653 3.5113 6.6193 2.2254 2.2826 1.5219 1.6413 1.8873 6.5811 1.2536 1.3772 5.9275 1.3926 2.1668 5.6805 1.3145 1.6898 3.2997 2.1198 1.7608 1.4414 2.5215 1.0528 1.1161 1.3183 1.3213 8.7576 8.6337 3.1571 2.1416 4.6010 3.8266 2.0904 3.1683 5.2389 5.9575 5.6081 1.3289 1.5491 1.0847 1.0884 1.0929 1.0924 1.0965 1.0926 1.1014 1.0443 1.0446 1.1048 1.1048
irintensity: 1.0657 0.2916 0.1656 5.3682 1.0222 1.0329 2.6135 16.0505 0.4991 7.8796 42.9559 383.7100 0.9818 0.7373 0.0412 0.3772 12.3796 173.0524 13.5850 0.7103 13.0405 7.2561 0.2927 0.5468 9.2954 42.5438 1.0884 65.8392 10.7452 65.1727 58.5597 0.8463 1.2376 23.3585 0.0467 0.7749 2.4287 0.2801 0.1966 19.1694 10.4988 5.4953 1.9296 8.9080 0.0471 1.5412 28.9350 0.7704 0.9203 0.2975 0.6255 9.9152 154.9277 7.3084 40.4055 339.7066 252.8547 11.3887 13.4178 480.7151 365.5695 0.4756 7.0155 19.1047 6.0552 22.1866 2.0808 17.1632 77.5202 91.8868 27.9379 30.2263
temp: 298.150 k
press: 1.00000 atm
elementType: 16 7 7 7 6 6 6 6 6 6 6 6 6 6 6 1 1 1 1 1 1 1 1 1 1 1
symmnumber: 1
zpe: 524312.8 jmol-1
zpe.correction: 0.199700 hartree
zpe.thermalcorrener: 0.213675 hartree
zpe.thermalcorrenthalpy: 0.214619 hartree
zpe.thermalcorrgfe: 0.157185 hartree
zpe.sumelectzpe: -987.038859 hartree
zpe.sumelectthermal: -987.024884 hartree
zpe.sumelectthermalent: -987.023940 hartree
zpe.sumelectthermalfe: -987.081375 hartree
dipole: 0.0248 1.6670 0.3500
dipole: 1.7035
quadrupole: -76.9220 -83.8851 -95.2894
quadrupole: -8.8512 5.2223 -1.9653
quadrupole: 8.4435 1.4804 -9.9239 -8.8512 5.2223 -1.9653
hfenergy: -987.2385595 hartree
pointgroup: C01 [X(C11H11N3S1)]
dipole: 0.0050359 -0.6588764 -0.1226002 debye
dipolederiv: -0.5320987 0.0361058 0.078155 0.0401984 -0.0438325 0.0065178 0.3252356 0.0314682 -0.1126752 -0.6921656 -0.275362 0.169055 -0.2064428 -0.9337921 0.2442257 0.1792308 0.2288642 -0.4116268 -0.2806683 0.1072992 -0.189455 0.2828011 -1.4948503 0.1505575 -0.2236999 0.142336 -0.704791 -1.4288286 -0.5172424 0.2962495 -0.4936105 -0.3672432 0.0759293 0.3502001 0.0947234 -0.8730698 1.056313 -0.0868042 -0.2777779 -0.2884251 0.6500363 -0.2105985 -0.4982143 -0.2351744 0.1369376 0.5989769 0.2917348 -0.0095229 0.535056 -0.0037631 0.0010781 -0.075138 0.0136886 0.0155272 -0.6755677 0.4964465 -0.0437436 0.1644141 -0.8083031 0.1434516 0.1311974 -0.0392134 -0.2298519 -1.1315307 -0.274391 0.2898758 0.4023812 -0.2380518 -0.093283 0.1489176 0.0871741 -0.3183882 0.732316 -0.2850149 -0.0697506 -0.2465905 1.7583983 -0.3612592 -0.126505 -0.2514053 0.2961605 1.7596856 0.5443573 -0.5809925 0.1718435 0.7224034 -0.1987301 -0.5220029 -0.290296 0.433089 -0.3032566 -0.0278584 0.0360435 -0.0742212 -0.0694342 0.0989619 -0.058043 0.0697261 -0.000536 -0.1889796 -0.0499573 -0.09923 -0.2046053 -0.1596682 -0.0053293 -0.045038 0.0146536 -0.0305279 0.0189984 0.0406994 -0.1229115 0.0669573 -0.0770824 0.0293076 -0.0970422 0.0447694 0.0274316 -0.015252 0.0733581 0.0041523 0.0613095 -0.0275251 0.1221987 -0.0410704 0.0970922 0.0463929 -0.0357262 0.1147925 -0.0119689 0.0733567 -0.0683744 0.041833 -0.0019166 0.0388977 -0.0904908 0.0433015 -0.0540174 0.0778914 -0.0654134 0.0357053 0.0379748 0.1118879 0.0331967 0.1228928 0.103021 0.0235141 0.0341521 -0.0079505 -0.0590602 0.0726675 0.0162617 0.0634235 0.1631863 0.1345063 -0.0520887 -0.0253492 -0.0330123 0.068989 -0.0971894 -0.0139879 -0.0782989 0.007286 0.0554506 -0.0178917 0.1016438 -0.0158077 0.1007436 -0.0108947 0.1118633 -0.0176157 0.0356292 -0.0252584 -0.0248417 0.1186001 -0.0378033 0.1228057 -0.0299213 0.1361002 -0.0255434 -0.0103459 0.067457 -0.0416705 -0.0030417 -0.064109 0.0526454 -0.1193857 -0.0308949 -0.1175684 -0.0292791 -0.0549874 -0.1216239 0.0070083 -0.141097 0.0577589 -0.033856 0.0056414 -0.0320086 0.1054222 0.1896144 -0.0178882 0.0673232 -0.0106986 0.2293223 0.0380405 0.0601152 0.044262 0.3488275 0.1285991 0.0292467 0.0710851 -0.0048552 0.2360357 0.0281493 0.0884139 0.0178137 0.3419923 0.2233741 0.0598182 0.0454397 0.0903435 0.1575986 0.0234742 0.0299039 0.0262967 0.368722 0.2527057 0.0292795 0.037069 0.0059811 0.1585382 0.0460797 0.0385839 0.0387381 0.3620856 unknown
polarizability: 229.9913057|20.0018051|153.1891415|-33.8123728|0.4361328|105.4029927 unknown
InChI: InChI=1S/C11H11N3S/c12-10-6-9(7-11(13)14-10)15-8-4-2-1-3-5-8/h1-7H,12-13H2
charge 0 multiplicity 1
26 atoms
S  -0.5278 1.933539 0.572348
N  3.276673 -0.660489 -0.176718
N  2.247928 -2.593253 0.619547
N  4.406058 1.208284 -0.99011
C  0.927993 0.849965 0.249986
C  -1.957612 0.77428 0.456475
C  0.941179 -0.51911 0.582711
C  2.070069 1.477088 -0.291787
C  2.147992 -1.238804 0.336244
C  3.234311 0.673252 -0.475142
C  -2.917203 0.798261 1.49521
C  -2.151427 -0.049554 -0.678444
C  -4.079684 -0.002352 1.394505
C  -3.304903 -0.860935 -0.76219
C  -4.274485 -0.835902 0.269619
H  0.068638 -1.011668 1.019056
H  2.060498 2.533346 -0.574654
H  -2.751941 1.430671 2.373662
H  -1.408001 -0.055572 -1.482003
H  -4.823416 0.021267 2.198706
H  -3.451831 -1.500723 -1.639564
H  -5.172334 -1.459389 0.19541
H  3.137007 -3.054516 0.444505
H  1.466784 -3.114884 1.003861
H  4.482512 2.191868 -1.228057
H  5.202696 0.587929 -1.11008
