program: Gaussian 09
title: 000251037
version: EM64L-G09RevD.01
frameworkgroup: C1[X(C10H18O5)]
method: RPBEPBE
basis: SDD
operation: Freq
keyword: #pfreq=noraman
keyword: PBEPBE/SDD
title: #p freq=noraman PBEPBE/SDD
converged: YES YES NO NO
title: Mulliken charges:
elementType: O O O O O C C C C C C C C C C H H H H H H H H H H H H H H H H H H
charge: -0.285623 -0.267943 -0.259747 -0.240396 -0.261891 -0.014213 -0.358232 -0.344137 0.279348 0.317913 -0.482594 -0.481507 -0.522515 -0.657558 -0.662259 0.230473 0.257783 0.254866 0.250393 0.235950 0.238995 0.246288 0.246564 0.242202 0.234445 0.200300 0.252208 0.225165 0.216158 0.233629 0.237392 0.216139 0.222404
chargesum: 0.00000
title: Mulliken charges with hydrogens summed into heavy atoms:
elementType: O O O O O C C C C C C C C C C
charge: -0.285623 -0.267943 -0.259747 -0.240396 -0.261891 0.216260 0.154417 0.142206 0.279348 0.317913 0.002690 0.007259 0.164438 0.017394 0.013675
polarizability: 1.59434960e+02 -2.25078245e+00 1.18213548e+02 6.87423658e+00 2.38139355e+00 9.82519959e+01
1716.lowfreq: -11.5209 -6.1701 -2.0831 -0.0003 0.0005 0.0008 4.1849 24.9758 38.2529
frequency: -9.9590 24.8828 38.2320 42.5484 54.3109 66.2075 67.9128 92.5404 127.2181 158.3780 179.7386 187.7340 197.8771 212.1976 230.5050 254.0358 262.6192 315.8324 327.7607 352.3989 408.1208 466.1762 498.2718 540.8636 555.6485 618.7883 629.3247 641.2843 776.3351 790.9259 792.4109 796.7228 824.9047 867.8507 917.1327 943.3519 988.1925 1016.3812 1019.4658 1042.4573 1073.2051 1078.9198 1084.2761 1085.4847 1088.5470 1120.2607 1122.9456 1131.8331 1134.2704 1170.4923 1221.6718 1242.4718 1246.1121 1252.6651 1309.4316 1322.9647 1334.0519 1339.7979 1358.3139 1372.9812 1398.9518 1400.1933 1434.3162 1442.7731 1443.4984 1445.1453 1447.1500 1459.2072 1471.9562 1473.2527 1480.6363 1483.4271 1486.4535 1648.7664 1650.3568 2943.7040 2948.0274 2994.5340 2997.7104 2998.8406 3000.5610 3033.2610 3044.3335 3045.7007 3054.3658 3056.4249 3094.5191 3096.6262 3103.9225 3105.2167 3105.6237 3108.8952 3140.1607
redmass: 1.9141 4.0283 6.7676 2.5319 4.0379 2.6928 3.7280 6.7111 2.3162 3.2969 1.3854 1.4351 1.2659 2.5182 2.8556 3.5836 4.1493 3.7298 4.1457 2.6433 3.8497 2.5810 3.9826 2.9097 2.9989 3.4550 4.0329 4.1121 3.4709 2.1577 1.3715 1.8073 3.5289 3.8108 3.7283 4.0097 2.4699 1.9350 1.9576 2.8404 2.3918 3.0244 1.7209 1.6652 2.6731 1.8926 1.8333 2.2710 2.2778 1.6946 1.2151 1.1738 1.1804 1.1139 1.2289 1.4805 1.5244 1.7753 1.4069 1.4109 1.2093 1.2120 1.1313 1.0925 1.0979 1.0793 1.0814 1.0629 1.0395 1.0401 1.0511 1.0512 1.0526 8.6386 9.0630 1.0790 1.0379 1.0622 1.0531 1.0380 1.0444 1.0579 1.1012 1.0982 1.0578 1.0956 1.1005 1.1004 1.1003 1.1010 1.1057 1.1004 1.1085
irintensity: 0.4487 0.1334 1.1418 0.3835 1.9113 4.2352 2.1107 1.3737 7.0336 0.2515 0.5917 0.7047 0.7010 4.0312 8.9626 4.3984 6.3604 15.8254 31.2122 10.8231 3.2320 7.9115 2.0128 2.1202 5.2140 0.8636 4.2343 9.6490 17.4906 9.7380 10.7508 21.6194 9.0950 6.6863 32.4218 5.4441 9.7728 81.2429 14.6327 41.9691 60.0636 142.5843 5.5271 3.5625 87.9358 215.9190 229.5616 82.2741 0.7707 7.7151 20.9819 1.9580 2.6721 5.0995 1.9988 11.9118 55.8306 10.5130 32.1634 6.7830 19.5972 18.5942 10.7833 30.2615 31.3650 21.9660 8.4390 11.9594 12.8680 12.8411 15.6594 14.7180 10.9795 129.1168 169.4657 25.6042 75.0444 20.7226 32.6602 21.9464 9.4268 31.5763 28.6318 4.6153 15.3793 4.1850 31.5074 31.1083 30.0726 17.3323 23.3177 18.3392 4.7764
temp: 298.150 k
press: 1.00000 atm
elementType: 8 8 8 8 8 6 6 6 6 6 6 6 6 6 6 1 1 1 1 1 1 1 1 1 1 1 1 1 1 1 1 1 1
symmnumber: 1
zpe: 714510.0 jmol-1
zpe.correction: 0.272142 hartree
zpe.thermalcorrener: 0.289677 hartree
zpe.thermalcorrenthalpy: 0.290621 hartree
zpe.thermalcorrgfe: 0.224453 hartree
zpe.sumelectzpe: -766.760829 hartree
zpe.sumelectthermal: -766.743295 hartree
zpe.sumelectthermalent: -766.742351 hartree
zpe.sumelectthermalfe: -766.808519 hartree
dipole: 0.4688 -1.8821 0.5658
dipole: 2.0204
quadrupole: -89.2554 -88.3351 -89.1147
quadrupole: -4.3274 7.9043 2.2419
quadrupole: -0.3537 0.5667 -0.2130 -4.3274 7.9043 2.2419
hfenergy: -767.032972 hartree
pointgroup: C01 [X(C10H18O5)]
dipole: 0.1878256 0.4962258 -0.5918853 debye
polarizability: 159.6143866|-1.4921176|114.3079298|-6.2422638|-8.3185923|101.9781875 unknown
InChI: InChI=1S/C10H18O5/c1-4-9(11)14-6-8(13-3)7-15-10(12)5-2/h8H,4-7H2,1-3H3
charge 0 multiplicity 1
33 atoms
O  -0.737547 -1.152809 1.690096
O  1.971114 0.915295 0.2276
O  -1.511534 0.564922 -0.560622
O  3.475797 -0.614141 1.152132
O  -3.234699 -1.016129 -0.534308
C  0.197476 -0.781851 0.62764
C  0.922854 0.458077 1.181974
C  -0.503817 -0.512968 -0.718415
C  3.230671 0.301223 0.335687
C  -2.849226 0.168102 -0.407905
C  4.201553 0.925205 -0.653943
C  -3.717172 1.37208 -0.083743
C  -1.254482 -2.525626 1.588026
C  5.565995 0.214341 -0.682242
C  -5.214072 1.11459 -0.336515
H  0.943921 -1.593078 0.467222
H  1.380278 0.209859 2.153329
H  0.231244 1.308649 1.269377
H  -0.999267 -1.420717 -1.104635
H  0.224257 -0.126349 -1.450352
H  3.722606 0.926091 -1.651359
H  4.315053 1.992302 -0.380045
H  -3.54015 1.616484 0.982898
H  -3.343828 2.237822 -0.659487
H  -1.804568 -2.70252 2.525384
H  -0.423035 -3.256111 1.504678
H  -1.948269 -2.630713 0.732483
H  5.459632 -0.840633 -0.988428
H  6.244762 0.717061 -1.393358
H  6.035431 0.221181 0.315937
H  -5.558333 0.227633 0.221427
H  -5.812468 1.986218 -0.018099
H  -5.411372 0.930908 -1.407034
