program: Gaussian 09
title: 000250990
version: EM64L-G09RevD.01
frameworkgroup: C1[X(C4H3F5S2)]
method: RPBEPBE
basis: SDD
operation: Freq
keyword: #pfreq=noraman
keyword: PBEPBE/SDD
title: #p freq=noraman PBEPBE/SDD
converged: YES YES NO NO
title: Mulliken charges:
elementType: S S F F F F F C C C C H H H
charge: 0.383302 0.207221 -0.133128 -0.156089 -0.143968 -0.131402 -0.131128 0.352725 0.411566 -0.685836 -0.819636 0.292154 0.260770 0.293448
chargesum: 0.00000
title: Mulliken charges with hydrogens summed into heavy atoms:
elementType: S S F F F F F C C C C
charge: 0.383302 0.207221 -0.133128 -0.156089 -0.143968 -0.131402 -0.131128 0.352725 0.411566 -0.685836 0.026738
polarizability: 8.88996427e+01 -6.20953060e+00 9.84623585e+01 -9.82591246e+00 -1.35071138e+00 5.07044152e+01
1716.lowfreq: -3.6634 -0.0023 -0.0011 0.0020 3.4739 10.7353 29.0087 48.5593 86.1090
frequency: 28.8707 48.4918 86.0959 137.5323 149.5311 170.9891 205.2291 227.5031 254.9476 271.8801 303.2907 319.8210 406.4755 435.6818 467.2822 471.2093 525.1712 604.4590 644.6148 662.6601 790.1890 963.9758 978.5691 986.3612 999.6625 1054.4133 1064.1723 1070.4104 1151.5871 1184.7548 1346.8700 1430.2426 1437.5151 3017.2191 3142.7681 3152.9222
redmass: 15.9037 11.7532 4.8707 9.2705 1.0441 9.1006 10.5620 7.7858 10.8783 10.0256 18.8407 18.2493 16.8894 14.1340 14.3270 17.5871 17.7567 15.4342 14.9941 8.2076 13.0545 10.5993 1.2024 1.7579 3.7186 12.1347 11.9537 12.9537 11.0185 12.2856 1.1320 1.0497 1.0487 1.0281 1.1050 1.1047
irintensity: 0.3204 0.6694 1.2304 0.7806 0.1375 0.5706 1.9833 2.5106 0.1952 5.3188 0.7710 0.6517 4.2251 4.2205 2.6709 3.2639 0.5545 6.9293 35.2706 2.3758 82.8680 122.8919 2.5239 17.8127 73.3053 182.0867 67.0843 271.1504 104.1166 53.6502 5.5621 20.6116 18.3766 5.5436 4.9011 3.4090
temp: 298.150 k
press: 1.00000 atm
elementType: 16 16 9 9 9 9 9 6 6 6 6 1 1 1
symmnumber: 1
zpe: 180596.4 jmol-1
zpe.correction: 0.068786 hartree
zpe.thermalcorrener: 0.080925 hartree
zpe.thermalcorrenthalpy: 0.081869 hartree
zpe.thermalcorrgfe: 0.028902 hartree
zpe.sumelectzpe: -1448.680601 hartree
zpe.sumelectthermal: -1448.668462 hartree
zpe.sumelectthermalent: -1448.667518 hartree
zpe.sumelectthermalfe: -1448.720485 hartree
dipole: 4.2375 -0.6611 -1.0176
dipole: 4.4078
quadrupole: -66.6315 -79.7819 -78.2535
quadrupole: -2.2756 -1.5269 0.4140
quadrupole: 8.2575 -4.8929 -3.3645 -2.2756 -1.5269 0.4140
hfenergy: -1448.749387 hartree
pointgroup: C01 [X(C4H3F5S2)]
dipole: -1.6756976 0.3678955 -0.2530989 debye
dipolederiv: -0.0747911 0.317612 -0.0479374 0.2979566 -0.5090885 0.1035649 -0.0508735 0.1078455 0.0819301 -0.1149594 -0.2333664 0.0156818 0.1605923 -0.6176308 0.1016097 -0.0375385 0.0214993 -0.0115238 -0.456878 0.1005608 -0.1237551 0.113713 -0.3196941 0.1344002 -0.2116341 0.1733823 -0.5067324 -0.4641774 -0.1312055 -0.0173032 -0.1122864 -0.6160815 -0.0711687 -0.0613365 -0.1481106 -0.3055335 -0.403451 0.0634309 -0.0481339 0.1188 -0.3796811 0.172229 -0.0735384 0.2164597 -0.6080451 -0.9253073 -0.1374399 -0.0992792 -0.1196193 -0.2732277 -0.0421866 0.0538193 -0.0171001 -0.3216798 -0.3362827 0.0398643 0.0452612 -0.0102446 -0.6531919 -0.1043105 0.0831178 -0.1718172 -0.3420161 0.9510987 0.0661785 0.1431252 0.0399331 0.8592373 -0.0409741 0.3014663 0.0059584 0.8899718 1.6065509 0.0514084 0.1345685 -0.0324133 1.270927 -0.0132891 -0.1885693 -0.0428953 1.2468446 0.024842 -0.1941127 -0.0055526 -0.3761318 1.079889 -0.2248261 0.179655 -0.1651143 -0.3004576 0.1180181 -0.044867 0.0197194 -0.0372508 0.0564666 -0.0133453 0.0098148 -0.0066982 0.0339149 0.0204525 0.0326941 0.0072253 -0.048464 0.0334117 -0.1053104 0.0164426 -0.0469287 0.0217165 0.0283926 0.0595357 -0.0261373 0.0925532 0.0041572 0.0345038 -0.0310228 0.0271106 0.1295739 0.0264922 0.0097068 0.0025172 -0.087138 0.0645068 0.0691032 0.0101975 0.0464087 -0.0079634 unknown
polarizability: 89.7742337|-4.3700298|98.6240273|5.7553647|-6.5307928|49.6681554 unknown
InChI: InChI=1S/C4H3F5S2/c1-11-2(10)3(5,6)4(7,8)9/h1H3
charge 0 multiplicity 1
14 atoms
S  -1.848642 1.453617 0.23711
S  -1.537905 -1.622889 0.609646
F  1.087094 -0.596184 1.797855
F  0.809268 1.564227 1.117244
F  1.000057 0.71315 -1.601955
F  2.792605 0.283102 -0.277213
F  1.421856 -1.406309 -0.905407
C  0.570051 0.201652 0.74691
C  1.459296 -0.062055 -0.521797
C  -0.928426 -0.062582 0.543388
C  -3.563113 0.745739 -0.026231
H  -3.540493 0.03351 -0.864674
H  -4.205603 1.609771 -0.252897
H  -3.891844 0.231849 0.889122
